openMSX Compile results



64 Bit 3rd Party results
64 Bit Compile results
32 Bit 3rd Party results
32 Bit Compile results
64 Bit Compile Catapult
32 Bit Compile Catapult
64 Bit MSI Package
32 Bit MSI Package


3rd party


C:\compiler\openMSX>call "python3" build\\thirdparty_download.py windows 
FreeType version 2.9.1 - already downloaded
Patched: freetype-2.9.1/include/freetype/config/ftoption.h
Patched: freetype-2.9.1/modules.cfg
GLEW version 2.1.0 - already downloaded
Patched: glew-2.1.0/config/Makefile.linux-mingw-w64
libogg version 1.3.3 - already downloaded
libpng version 1.6.36 - already downloaded
SDL2 version 2.0.10 - already downloaded
SDL2_ttf version 2.0.15 - already downloaded
WARNING: Skipping symlink creation: C:\compiler\openMSX\derived\3rdparty\src\SDL2_ttf-2.0.15\Xcode\Frameworks\FreeType.framework\FreeType -> Versions/Current/FreeType: symbolic link privilege not held
WARNING: Skipping symlink creation: C:\compiler\openMSX\derived\3rdparty\src\SDL2_ttf-2.0.15\Xcode\Frameworks\FreeType.framework\Resources -> Versions/Current/Resources: symbolic link privilege not held
WARNING: Skipping symlink creation: C:\compiler\openMSX\derived\3rdparty\src\SDL2_ttf-2.0.15\Xcode\Frameworks\FreeType.framework\Headers -> Versions/Current/Headers: symbolic link privilege not held
WARNING: Skipping symlink creation: C:\compiler\openMSX\derived\3rdparty\src\SDL2_ttf-2.0.15\Xcode\Frameworks\FreeType.framework\Versions\Current -> A: symbolic link privilege not held
Tcl version 8.6.9 - already downloaded
libtheora version 1.1.1 - already downloaded
Patched: libtheora-1.1.1/configure
libvorbis version 1.3.6 - already downloaded
zlib version 1.2.11 - already downloaded
Back To Top
**********************************************************************
** Visual Studio 2019 Developer Command Prompt v16.3.4
** Copyright (c) 2019 Microsoft Corporation
**********************************************************************
[vcvarsall.bat] Environment initialized for: 'x64'

64 bit 3rd party

Microsoft (R) Build Engine version 16.3.1+1def00d3d for .NET Framework
Copyright (C) Microsoft Corporation. All rights reserved.

Building the projects in this solution one at a time. To enable parallel build, please add the "-m" switch.
Build started 10/13/2019 11:15:23 AM.
Project "C:\compiler\openMSX\build\3rdparty\3rdparty.sln" on node 1 (default targets).
ValidateSolutionConfiguration:
  Building solution configuration "Release|x64".
Project "C:\compiler\openMSX\build\3rdparty\3rdparty.sln" (1) is building "C:\compiler\openMSX\build\3rdparty\glew.vcxproj" (2) on node 1 (default targets).
InitializeBuildStatus:
  Creating "..\..\derived\x64-VC-Release\3rdParty\build\glew-2.1.0\glew.tlog\unsuccessfulbuild" because "AlwaysCreate" was specified.
ClCompile:
  All outputs are up-to-date.
ResourceCompile:
  All outputs are up-to-date.
Lib:
  All outputs are up-to-date.
  glew.vcxproj -> C:\compiler\openMSX\build\3rdparty\..\..\derived\x64-VC-Release\3rdParty\install\lib\glew.lib
FinalizeBuildStatus:
  Deleting file "..\..\derived\x64-VC-Release\3rdParty\build\glew-2.1.0\glew.tlog\unsuccessfulbuild".
  Touching "..\..\derived\x64-VC-Release\3rdParty\build\glew-2.1.0\glew.tlog\glew.lastbuildstate".
Done Building Project "C:\compiler\openMSX\build\3rdparty\glew.vcxproj" (default targets).
Project "C:\compiler\openMSX\build\3rdparty\3rdparty.sln" (1) is building "C:\compiler\openMSX\build\3rdparty\freetype.vcxproj" (3) on node 1 (default targets).
InitializeBuildStatus:
  Creating "..\..\derived\x64-VC-Release\3rdParty\build\freetype-2.9.1\freetype.tlog\unsuccessfulbuild" because "AlwaysCreate" was specified.
ClCompile:
  C:\Program Files (x86)\Microsoft Visual Studio\2019\Professional\VC\Tools\MSVC\14.23.28105\bin\HostX86\x64\CL.exe /c /I"..\..\derived\3rdParty\src\freetype-2.9.1\include" /nologo /W4 /WX- /diagnostics:column /Ox /Ob2 /Oi /Os /Oy /GT /GL /D NDEBUG /D WIN32 /D _LIB /D FT2_BUILD_LIBRARY /D _CRT_SECURE_NO_WARNINGS /D _VC80_UPGRADE=0x0710 /D _MBCS /GF /Gm- /EHsc /MT /GS /Gy /fp:precise /Za /Zc:wchar_t /Zc:forScope /Zc:inline /Fo"..\..\derived\x64-VC-Release\3rdParty\build\freetype-2.9.1\\" /Fd"..\..\derived\x64-VC-Release\3rdParty\build\freetype-2.9.1\freetype.pdb" /Gd /TC /wd4001 /FC /errorReport:queue "..\..\derived\3rdParty\src\freetype-2.9.1\src\autofit\autofit.c" "..\..\derived\3rdParty\src\freetype-2.9.1\src\base\ftbbox.c" "..\..\derived\3rdParty\src\freetype-2.9.1\src\base\ftbitmap.c" "..\..\derived\3rdParty\src\freetype-2.9.1\src\base\ftgasp.c" "..\..\derived\3rdParty\src\freetype-2.9.1\src\base\ftpfr.c" "..\..\derived\3rdParty\src\freetype-2.9.1\src\base\ftstroke.c" "..\..\derived\3rdParty\src\freetype-2.9.1\src\base\ftsynth.c" "..\..\derived\3rdParty\src\freetype-2.9.1\src\base\fttype1.c" "..\..\derived\3rdParty\src\freetype-2.9.1\src\base\ftwinfnt.c"
  autofit.c
  ftbbox.c
  ftbitmap.c
  ftgasp.c
  ftpfr.c
  ftstroke.c
  ftsynth.c
  fttype1.c
  ftwinfnt.c
  C:\Program Files (x86)\Microsoft Visual Studio\2019\Professional\VC\Tools\MSVC\14.23.28105\bin\HostX86\x64\CL.exe /c /I"..\..\derived\3rdParty\src\freetype-2.9.1\include" /nologo /W4 /WX- /diagnostics:column /O2 /Ob2 /Oi /Os /Oy /GT /GL /D NDEBUG /D WIN32 /D _LIB /D FT2_BUILD_LIBRARY /D _CRT_SECURE_NO_WARNINGS /D _VC80_UPGRADE=0x0710 /D _MBCS /GF /Gm- /EHsc /MT /GS /Gy /fp:precise /Za /Zc:wchar_t /Zc:forScope /Zc:inline /Fo"..\..\derived\x64-VC-Release\3rdParty\build\freetype-2.9.1\\" /Fd"..\..\derived\x64-VC-Release\3rdParty\build\freetype-2.9.1\freetype.pdb" /Gd /TC /wd4001 /FC /errorReport:queue "..\..\derived\3rdParty\src\freetype-2.9.1\src\base\ftbase.c" "..\..\derived\3rdParty\src\freetype-2.9.1\src\base\ftglyph.c" "..\..\derived\3rdParty\src\freetype-2.9.1\src\base\ftinit.c" "..\..\derived\3rdParty\src\freetype-2.9.1\src\base\ftmm.c" "..\..\derived\3rdParty\src\freetype-2.9.1\src\base\ftsystem.c" "..\..\derived\3rdParty\src\freetype-2.9.1\src\bdf\bdf.c" "..\..\derived\3rdParty\src\freetype-2.9.1\src\cache\ftcache.c" "..\..\derived\3rdParty\src\freetype-2.9.1\src\cff\cff.c" "..\..\derived\3rdParty\src\freetype-2.9.1\src\cid\type1cid.c" "..\..\derived\3rdParty\src\freetype-2.9.1\src\gzip\ftgzip.c" "..\..\derived\3rdParty\src\freetype-2.9.1\src\lzw\ftlzw.c" "..\..\derived\3rdParty\src\freetype-2.9.1\src\pcf\pcf.c" "..\..\derived\3rdParty\src\freetype-2.9.1\src\pfr\pfr.c" "..\..\derived\3rdParty\src\freetype-2.9.1\src\psaux\psaux.c" "..\..\derived\3rdParty\src\freetype-2.9.1\src\pshinter\pshinter.c" "..\..\derived\3rdParty\src\freetype-2.9.1\src\psnames\psmodule.c" "..\..\derived\3rdParty\src\freetype-2.9.1\src\raster\raster.c" "..\..\derived\3rdParty\src\freetype-2.9.1\src\sfnt\sfnt.c" "..\..\derived\3rdParty\src\freetype-2.9.1\src\smooth\smooth.c" "..\..\derived\3rdParty\src\freetype-2.9.1\src\truetype\truetype.c" "..\..\derived\3rdParty\src\freetype-2.9.1\src\type1\type1.c" "..\..\derived\3rdParty\src\freetype-2.9.1\src\type42\type42.c" "..\..\derived\3rdParty\src\freetype-2.9.1\src\winfonts\winfnt.c"
  ftbase.c
  ftglyph.c
  ftinit.c
  ftmm.c
  ftsystem.c
  bdf.c
  ftcache.c
  cff.c
  type1cid.c
  ftgzip.c
  ftlzw.c
  pcf.c
  pfr.c
  psaux.c
  pshinter.c
  psmodule.c
  raster.c
  sfnt.c
C:\compiler\openMSX\derived\3rdParty\src\freetype-2.9.1\src\psaux\psintrp.c(1002,29): warning C4267: '=': conversion from 'size_t' to 'FT_Fast', possible loss of data [C:\compiler\openMSX\build\3rdparty\freetype.vcxproj]
C:\compiler\openMSX\derived\3rdParty\src\freetype-2.9.1\src\sfnt\sfdriver.c(838,32): warning C4267: '=': conversion from 'size_t' to 'FT_UInt', possible loss of data [C:\compiler\openMSX\build\3rdparty\freetype.vcxproj]
  smooth.c
C:\compiler\openMSX\derived\3rdParty\src\freetype-2.9.1\src\sfnt\sfdriver.c(989,44): warning C4244: 'function': conversion from '__int64' to 'const unsigned int', possible loss of data [C:\compiler\openMSX\build\3rdparty\freetype.vcxproj]
  truetype.c
C:\compiler\openMSX\derived\3rdParty\src\freetype-2.9.1\src\smooth\ftgrays.c(1773,26): warning C4267: '+=': conversion from 'size_t' to 'TCoord', possible loss of data [C:\compiler\openMSX\build\3rdparty\freetype.vcxproj]
  Compiling...
  type1.c
C:\compiler\openMSX\derived\3rdParty\src\freetype-2.9.1\src\truetype\ttgload.c(1797,42): warning C4312: 'type cast': conversion from 'unsigned long' to 'void *' of greater size [C:\compiler\openMSX\build\3rdparty\freetype.vcxproj]
C:\compiler\openMSX\derived\3rdParty\src\freetype-2.9.1\src\type1\t1driver.c(273,49): warning C4267: '=': conversion from 'size_t' to 'FT_ULong', possible loss of data [C:\compiler\openMSX\build\3rdparty\freetype.vcxproj]
C:\compiler\openMSX\derived\3rdParty\src\freetype-2.9.1\src\type1\t1driver.c(293,58): warning C4267: '=': conversion from 'size_t' to 'FT_ULong', possible loss of data [C:\compiler\openMSX\build\3rdparty\freetype.vcxproj]
C:\compiler\openMSX\derived\3rdParty\src\freetype-2.9.1\src\type1\t1driver.c(325,65): warning C4267: '=': conversion from 'size_t' to 'FT_ULong', possible loss of data [C:\compiler\openMSX\build\3rdparty\freetype.vcxproj]
C:\compiler\openMSX\derived\3rdParty\src\freetype-2.9.1\src\type1\t1driver.c(355,23): warning C4267: '=': conversion from 'size_t' to 'FT_UInt', possible loss of data [C:\compiler\openMSX\build\3rdparty\freetype.vcxproj]
C:\compiler\openMSX\derived\3rdParty\src\freetype-2.9.1\src\type1\t1driver.c(562,57): warning C4267: '=': conversion from 'size_t' to 'FT_ULong', possible loss of data [C:\compiler\openMSX\build\3rdparty\freetype.vcxproj]
C:\compiler\openMSX\derived\3rdParty\src\freetype-2.9.1\src\type1\t1driver.c(568,56): warning C4267: '=': conversion from 'size_t' to 'FT_ULong', possible loss of data [C:\compiler\openMSX\build\3rdparty\freetype.vcxproj]
C:\compiler\openMSX\derived\3rdParty\src\freetype-2.9.1\src\type1\t1driver.c(574,59): warning C4267: '=': conversion from 'size_t' to 'FT_ULong', possible loss of data [C:\compiler\openMSX\build\3rdparty\freetype.vcxproj]
C:\compiler\openMSX\derived\3rdParty\src\freetype-2.9.1\src\type1\t1driver.c(580,61): warning C4267: '=': conversion from 'size_t' to 'FT_ULong', possible loss of data [C:\compiler\openMSX\build\3rdparty\freetype.vcxproj]
C:\compiler\openMSX\derived\3rdParty\src\freetype-2.9.1\src\type1\t1driver.c(586,56): warning C4267: '=': conversion from 'size_t' to 'FT_ULong', possible loss of data [C:\compiler\openMSX\build\3rdparty\freetype.vcxproj]
C:\compiler\openMSX\derived\3rdParty\src\freetype-2.9.1\src\type1\t1load.c(1581,68): warning C4244: '=': conversion from '__int64' to 'FT_Int', possible loss of data [C:\compiler\openMSX\build\3rdparty\freetype.vcxproj]
  type42.c
C:\compiler\openMSX\derived\3rdParty\src\freetype-2.9.1\src\type1\t1load.c(1742,40): warning C4244: '=': conversion from '__int64' to 'FT_Int', possible loss of data [C:\compiler\openMSX\build\3rdparty\freetype.vcxproj]
  winfnt.c
C:\compiler\openMSX\derived\3rdParty\src\freetype-2.9.1\src\type42\t42parse.c(821,66): warning C4244: '=': conversion from '__int64' to 'FT_Int', possible loss of data [C:\compiler\openMSX\build\3rdparty\freetype.vcxproj]
  C:\Program Files (x86)\Microsoft Visual Studio\2019\Professional\VC\Tools\MSVC\14.23.28105\bin\HostX86\x64\CL.exe /c /I"..\..\derived\3rdParty\src\freetype-2.9.1\include" /nologo /W4 /WX- /diagnostics:column /O2 /Ob2 /Oi /Os /Oy /GT /GL /D NDEBUG /D WIN32 /D _LIB /D FT2_BUILD_LIBRARY /D _CRT_SECURE_NO_WARNINGS /D _VC80_UPGRADE=0x0710 /D _MBCS /GF /Gm- /EHsc /MT /GS /Gy /fp:precise /Zc:wchar_t /Zc:forScope /Zc:inline /Fo"..\..\derived\x64-VC-Release\3rdParty\build\freetype-2.9.1\\" /Fd"..\..\derived\x64-VC-Release\3rdParty\build\freetype-2.9.1\freetype.pdb" /Gd /TC /wd4001 /FC /errorReport:queue "..\..\derived\3rdParty\src\freetype-2.9.1\builds\windows\ftdebug.c"
  ftdebug.c
Lib:
  C:\Program Files (x86)\Microsoft Visual Studio\2019\Professional\VC\Tools\MSVC\14.23.28105\bin\HostX86\x64\Lib.exe /OUT:"..\..\derived\x64-VC-Release\3rdParty\install\lib\freetype.lib" /NOLOGO /MACHINE:X64 /LTCG "..\..\derived\x64-VC-Release\3rdParty\build\freetype-2.9.1\autofit.obj"
  "..\..\derived\x64-VC-Release\3rdParty\build\freetype-2.9.1\bdf.obj"
  "..\..\derived\x64-VC-Release\3rdParty\build\freetype-2.9.1\cff.obj"
  "..\..\derived\x64-VC-Release\3rdParty\build\freetype-2.9.1\ftbase.obj"
  "..\..\derived\x64-VC-Release\3rdParty\build\freetype-2.9.1\ftbitmap.obj"
  "..\..\derived\x64-VC-Release\3rdParty\build\freetype-2.9.1\ftcache.obj"
  "..\..\derived\x64-VC-Release\3rdParty\build\freetype-2.9.1\ftdebug.obj"
  "..\..\derived\x64-VC-Release\3rdParty\build\freetype-2.9.1\ftgasp.obj"
  "..\..\derived\x64-VC-Release\3rdParty\build\freetype-2.9.1\ftglyph.obj"
  "..\..\derived\x64-VC-Release\3rdParty\build\freetype-2.9.1\ftgzip.obj"
  "..\..\derived\x64-VC-Release\3rdParty\build\freetype-2.9.1\ftinit.obj"
  "..\..\derived\x64-VC-Release\3rdParty\build\freetype-2.9.1\ftlzw.obj"
  "..\..\derived\x64-VC-Release\3rdParty\build\freetype-2.9.1\ftstroke.obj"
  "..\..\derived\x64-VC-Release\3rdParty\build\freetype-2.9.1\ftsystem.obj"
  "..\..\derived\x64-VC-Release\3rdParty\build\freetype-2.9.1\smooth.obj"
  "..\..\derived\x64-VC-Release\3rdParty\build\freetype-2.9.1\ftbbox.obj"
  "..\..\derived\x64-VC-Release\3rdParty\build\freetype-2.9.1\ftmm.obj"
  "..\..\derived\x64-VC-Release\3rdParty\build\freetype-2.9.1\ftpfr.obj"
  "..\..\derived\x64-VC-Release\3rdParty\build\freetype-2.9.1\ftsynth.obj"
  "..\..\derived\x64-VC-Release\3rdParty\build\freetype-2.9.1\fttype1.obj"
  "..\..\derived\x64-VC-Release\3rdParty\build\freetype-2.9.1\ftwinfnt.obj"
  "..\..\derived\x64-VC-Release\3rdParty\build\freetype-2.9.1\pcf.obj"
  "..\..\derived\x64-VC-Release\3rdParty\build\freetype-2.9.1\pfr.obj"
  "..\..\derived\x64-VC-Release\3rdParty\build\freetype-2.9.1\psaux.obj"
  "..\..\derived\x64-VC-Release\3rdParty\build\freetype-2.9.1\pshinter.obj"
  "..\..\derived\x64-VC-Release\3rdParty\build\freetype-2.9.1\psmodule.obj"
  "..\..\derived\x64-VC-Release\3rdParty\build\freetype-2.9.1\raster.obj"
  "..\..\derived\x64-VC-Release\3rdParty\build\freetype-2.9.1\sfnt.obj"
  "..\..\derived\x64-VC-Release\3rdParty\build\freetype-2.9.1\truetype.obj"
  "..\..\derived\x64-VC-Release\3rdParty\build\freetype-2.9.1\type1.obj"
  "..\..\derived\x64-VC-Release\3rdParty\build\freetype-2.9.1\type1cid.obj"
  "..\..\derived\x64-VC-Release\3rdParty\build\freetype-2.9.1\type42.obj"
  "..\..\derived\x64-VC-Release\3rdParty\build\freetype-2.9.1\winfnt.obj"
  freetype.vcxproj -> C:\compiler\openMSX\build\3rdparty\..\..\derived\x64-VC-Release\3rdParty\install\lib\freetype.lib
FinalizeBuildStatus:
  Deleting file "..\..\derived\x64-VC-Release\3rdParty\build\freetype-2.9.1\freetype.tlog\unsuccessfulbuild".
  Touching "..\..\derived\x64-VC-Release\3rdParty\build\freetype-2.9.1\freetype.tlog\freetype.lastbuildstate".
Done Building Project "C:\compiler\openMSX\build\3rdparty\freetype.vcxproj" (default targets).
Project "C:\compiler\openMSX\build\3rdparty\3rdparty.sln" (1) is building "C:\compiler\openMSX\build\3rdparty\libogg.vcxproj" (4) on node 1 (default targets).
InitializeBuildStatus:
  Creating "..\..\derived\x64-VC-Release\3rdParty\build\libogg-1.3.3\libogg.tlog\unsuccessfulbuild" because "AlwaysCreate" was specified.
ClCompile:
  All outputs are up-to-date.
Lib:
  All outputs are up-to-date.
  libogg.vcxproj -> C:\compiler\openMSX\build\3rdparty\..\..\derived\x64-VC-Release\3rdParty\install\lib\libogg.lib
FinalizeBuildStatus:
  Deleting file "..\..\derived\x64-VC-Release\3rdParty\build\libogg-1.3.3\libogg.tlog\unsuccessfulbuild".
  Touching "..\..\derived\x64-VC-Release\3rdParty\build\libogg-1.3.3\libogg.tlog\libogg.lastbuildstate".
Done Building Project "C:\compiler\openMSX\build\3rdparty\libogg.vcxproj" (default targets).
Project "C:\compiler\openMSX\build\3rdparty\3rdparty.sln" (1) is building "C:\compiler\openMSX\build\3rdparty\libpng.vcxproj" (5) on node 1 (default targets).
InitializeBuildStatus:
  Creating "..\..\derived\x64-VC-Release\3rdParty\build\libpng-1.6.36\libpng.tlog\unsuccessfulbuild" because "AlwaysCreate" was specified.
PreBuildEvent:
  copy ..\..\derived\3rdParty\src\libpng-1.6.36\scripts\pnglibconf.h.prebuilt ..\..\derived\3rdParty\src\libpng-1.6.36\pnglibconf.h
  :VCEnd
          1 file(s) copied.
ClCompile:
  All outputs are up-to-date.
ResourceCompile:
  All outputs are up-to-date.
Lib:
  All outputs are up-to-date.
  libpng.vcxproj -> C:\compiler\openMSX\build\3rdparty\..\..\derived\x64-VC-Release\3rdParty\install\lib\libpng.lib
FinalizeBuildStatus:
  Deleting file "..\..\derived\x64-VC-Release\3rdParty\build\libpng-1.6.36\libpng.tlog\unsuccessfulbuild".
  Touching "..\..\derived\x64-VC-Release\3rdParty\build\libpng-1.6.36\libpng.tlog\libpng.lastbuildstate".
Done Building Project "C:\compiler\openMSX\build\3rdparty\libpng.vcxproj" (default targets).
Project "C:\compiler\openMSX\build\3rdparty\3rdparty.sln" (1) is building "C:\compiler\openMSX\build\3rdparty\libtheora.vcxproj" (6) on node 1 (default targets).
InitializeBuildStatus:
  Creating "..\..\derived\x64-VC-Release\3rdParty\build\libtheora-1.1.1\libtheora.tlog\unsuccessfulbuild" because "AlwaysCreate" was specified.
ClCompile:
  All outputs are up-to-date.
  All outputs are up-to-date.
  All outputs are up-to-date.
  All outputs are up-to-date.
Lib:
  All outputs are up-to-date.
  libtheora.vcxproj -> C:\compiler\openMSX\build\3rdparty\..\..\derived\x64-VC-Release\3rdParty\install\lib\libtheora.lib
FinalizeBuildStatus:
  Deleting file "..\..\derived\x64-VC-Release\3rdParty\build\libtheora-1.1.1\libtheora.tlog\unsuccessfulbuild".
  Touching "..\..\derived\x64-VC-Release\3rdParty\build\libtheora-1.1.1\libtheora.tlog\libtheora.lastbuildstate".
Done Building Project "C:\compiler\openMSX\build\3rdparty\libtheora.vcxproj" (default targets).
Project "C:\compiler\openMSX\build\3rdparty\3rdparty.sln" (1) is building "C:\compiler\openMSX\build\3rdparty\libvorbis.vcxproj" (7) on node 1 (default targets).
InitializeBuildStatus:
  Creating "..\..\derived\x64-VC-Release\3rdParty\build\libvorbis-1.3.6\libvorbis.tlog\unsuccessfulbuild" because "AlwaysCreate" was specified.
ClCompile:
  All outputs are up-to-date.
Lib:
  All outputs are up-to-date.
  libvorbis.vcxproj -> C:\compiler\openMSX\build\3rdparty\..\..\derived\x64-VC-Release\3rdParty\install\lib\libvorbis.lib
FinalizeBuildStatus:
  Deleting file "..\..\derived\x64-VC-Release\3rdParty\build\libvorbis-1.3.6\libvorbis.tlog\unsuccessfulbuild".
  Touching "..\..\derived\x64-VC-Release\3rdParty\build\libvorbis-1.3.6\libvorbis.tlog\libvorbis.lastbuildstate".
Done Building Project "C:\compiler\openMSX\build\3rdparty\libvorbis.vcxproj" (default targets).
Project "C:\compiler\openMSX\build\3rdparty\3rdparty.sln" (1) is building "C:\compiler\openMSX\build\3rdparty\SDL.vcxproj" (8) on node 1 (default targets).
InitializeBuildStatus:
  Creating "..\..\derived\x64-VC-Release\3rdParty\build\SDL2-2.0.10\SDL.tlog\unsuccessfulbuild" because "AlwaysCreate" was specified.
ClCompile:
  All outputs are up-to-date.
Lib:
  All outputs are up-to-date.
  SDL.vcxproj -> C:\compiler\openMSX\build\3rdparty\..\..\derived\x64-VC-Release\3rdParty\install\lib\SDL.lib
FinalizeBuildStatus:
  Deleting file "..\..\derived\x64-VC-Release\3rdParty\build\SDL2-2.0.10\SDL.tlog\unsuccessfulbuild".
  Touching "..\..\derived\x64-VC-Release\3rdParty\build\SDL2-2.0.10\SDL.tlog\SDL.lastbuildstate".
Done Building Project "C:\compiler\openMSX\build\3rdparty\SDL.vcxproj" (default targets).
Project "C:\compiler\openMSX\build\3rdparty\3rdparty.sln" (1) is building "C:\compiler\openMSX\build\3rdparty\SDL_ttf.vcxproj" (9) on node 1 (default targets).
InitializeBuildStatus:
  Creating "..\..\derived\x64-VC-Release\3rdParty\build\SDL2_ttf-2.0.15\SDL_ttf.tlog\unsuccessfulbuild" because "AlwaysCreate" was specified.
ClCompile:
  C:\Program Files (x86)\Microsoft Visual Studio\2019\Professional\VC\Tools\MSVC\14.23.28105\bin\HostX86\x64\CL.exe /c /I"..\..\derived\3rdParty\src\SDL2-2.0.10\include" /I"..\..\derived\3rdParty\src\freetype-2.9.1\include" /Zi /nologo /W3 /WX- /diagnostics:column /Ox /Ob2 /Oi /Os /Oy /GT /GL /D WIN32 /D NDEBUG /D _WINDOWS /D _VC80_UPGRADE=0x0600 /GF /Gm- /EHsc /MT /GS /Gy /fp:precise /Zc:wchar_t /Zc:forScope /Zc:inline /Fo"..\..\derived\x64-VC-Release\3rdParty\build\SDL2_ttf-2.0.15\\" /Fd"..\..\derived\x64-VC-Release\3rdParty\build\SDL2_ttf-2.0.15\SDL_ttf.pdb" /Gd /TC /FC /errorReport:queue "..\..\derived\3rdParty\src\SDL2_ttf-2.0.15\SDL_ttf.c"
  SDL_ttf.c
C:\compiler\openMSX\derived\3rdParty\src\SDL2_ttf-2.0.15\SDL_ttf.c(602,38): warning C4244: '+=': conversion from 'float' to 'int', possible loss of data [C:\compiler\openMSX\build\3rdparty\SDL_ttf.vcxproj]
C:\compiler\openMSX\derived\3rdParty\src\SDL2_ttf-2.0.15\SDL_ttf.c(603,38): warning C4244: '+=': conversion from 'float' to 'int', possible loss of data [C:\compiler\openMSX\build\3rdparty\SDL_ttf.vcxproj]
C:\compiler\openMSX\derived\3rdParty\src\SDL2_ttf-2.0.15\SDL_ttf.c(1949,55): warning C4018: '>': signed/unsigned mismatch [C:\compiler\openMSX\build\3rdparty\SDL_ttf.vcxproj]
Lib:
  C:\Program Files (x86)\Microsoft Visual Studio\2019\Professional\VC\Tools\MSVC\14.23.28105\bin\HostX86\x64\Lib.exe /OUT:"..\..\derived\x64-VC-Release\3rdParty\install\lib\SDL_ttf.lib" /NOLOGO /MACHINE:X64 /LTCG "..\..\derived\x64-VC-Release\3rdParty\build\SDL2_ttf-2.0.15\SDL_ttf.obj"
  SDL_ttf.vcxproj -> C:\compiler\openMSX\build\3rdparty\..\..\derived\x64-VC-Release\3rdParty\install\lib\SDL_ttf.lib
FinalizeBuildStatus:
  Deleting file "..\..\derived\x64-VC-Release\3rdParty\build\SDL2_ttf-2.0.15\SDL_ttf.tlog\unsuccessfulbuild".
  Touching "..\..\derived\x64-VC-Release\3rdParty\build\SDL2_ttf-2.0.15\SDL_ttf.tlog\SDL_ttf.lastbuildstate".
Done Building Project "C:\compiler\openMSX\build\3rdparty\SDL_ttf.vcxproj" (default targets).
Project "C:\compiler\openMSX\build\3rdparty\3rdparty.sln" (1) is building "C:\compiler\openMSX\build\3rdparty\SDLmain.vcxproj" (10) on node 1 (default targets).
InitializeBuildStatus:
  Creating "..\..\derived\x64-VC-Release\3rdParty\build\SDLmain\SDLmain.tlog\unsuccessfulbuild" because "AlwaysCreate" was specified.
ClCompile:
  All outputs are up-to-date.
Lib:
  All outputs are up-to-date.
  SDLmain.vcxproj -> C:\compiler\openMSX\build\3rdparty\..\..\derived\x64-VC-Release\3rdParty\install\lib\SDLmain.lib
FinalizeBuildStatus:
  Deleting file "..\..\derived\x64-VC-Release\3rdParty\build\SDLmain\SDLmain.tlog\unsuccessfulbuild".
  Touching "..\..\derived\x64-VC-Release\3rdParty\build\SDLmain\SDLmain.tlog\SDLmain.lastbuildstate".
Done Building Project "C:\compiler\openMSX\build\3rdparty\SDLmain.vcxproj" (default targets).
Project "C:\compiler\openMSX\build\3rdparty\3rdparty.sln" (1) is building "C:\compiler\openMSX\build\3rdparty\tcl.vcxproj" (11) on node 1 (default targets).
InitializeBuildStatus:
  Creating "..\..\derived\x64-VC-Release\3rdParty\build\tcl8.6.9\tcl.tlog\unsuccessfulbuild" because "AlwaysCreate" was specified.
ClCompile:
  All outputs are up-to-date.
Lib:
  All outputs are up-to-date.
  tcl.vcxproj -> C:\compiler\openMSX\build\3rdparty\..\..\derived\x64-VC-Release\3rdParty\install\lib\tcl.lib
FinalizeBuildStatus:
  Deleting file "..\..\derived\x64-VC-Release\3rdParty\build\tcl8.6.9\tcl.tlog\unsuccessfulbuild".
  Touching "..\..\derived\x64-VC-Release\3rdParty\build\tcl8.6.9\tcl.tlog\tcl.lastbuildstate".
Done Building Project "C:\compiler\openMSX\build\3rdparty\tcl.vcxproj" (default targets).
Project "C:\compiler\openMSX\build\3rdparty\3rdparty.sln" (1) is building "C:\compiler\openMSX\build\3rdparty\zlib.vcxproj" (12) on node 1 (default targets).
InitializeBuildStatus:
  Creating "..\..\derived\x64-VC-Release\3rdParty\build\zlib-1.2.11\zlib.tlog\unsuccessfulbuild" because "AlwaysCreate" was specified.
ClCompile:
  All outputs are up-to-date.
ResourceCompile:
  All outputs are up-to-date.
Lib:
  All outputs are up-to-date.
  zlib.vcxproj -> C:\compiler\openMSX\build\3rdparty\..\..\derived\x64-VC-Release\3rdParty\install\lib\zlib.lib
FinalizeBuildStatus:
  Deleting file "..\..\derived\x64-VC-Release\3rdParty\build\zlib-1.2.11\zlib.tlog\unsuccessfulbuild".
  Touching "..\..\derived\x64-VC-Release\3rdParty\build\zlib-1.2.11\zlib.tlog\zlib.lastbuildstate".
Done Building Project "C:\compiler\openMSX\build\3rdparty\zlib.vcxproj" (default targets).
Done Building Project "C:\compiler\openMSX\build\3rdparty\3rdparty.sln" (default targets).

Build succeeded.

"C:\compiler\openMSX\build\3rdparty\3rdparty.sln" (default target) (1) ->
"C:\compiler\openMSX\build\3rdparty\freetype.vcxproj" (default target) (3) ->
(ClCompile target) -> 
  C:\compiler\openMSX\derived\3rdParty\src\freetype-2.9.1\src\psaux\psintrp.c(1002,29): warning C4267: '=': conversion from 'size_t' to 'FT_Fast', possible loss of data [C:\compiler\openMSX\build\3rdparty\freetype.vcxproj]
  C:\compiler\openMSX\derived\3rdParty\src\freetype-2.9.1\src\sfnt\sfdriver.c(838,32): warning C4267: '=': conversion from 'size_t' to 'FT_UInt', possible loss of data [C:\compiler\openMSX\build\3rdparty\freetype.vcxproj]
  C:\compiler\openMSX\derived\3rdParty\src\freetype-2.9.1\src\sfnt\sfdriver.c(989,44): warning C4244: 'function': conversion from '__int64' to 'const unsigned int', possible loss of data [C:\compiler\openMSX\build\3rdparty\freetype.vcxproj]
  C:\compiler\openMSX\derived\3rdParty\src\freetype-2.9.1\src\smooth\ftgrays.c(1773,26): warning C4267: '+=': conversion from 'size_t' to 'TCoord', possible loss of data [C:\compiler\openMSX\build\3rdparty\freetype.vcxproj]
  C:\compiler\openMSX\derived\3rdParty\src\freetype-2.9.1\src\truetype\ttgload.c(1797,42): warning C4312: 'type cast': conversion from 'unsigned long' to 'void *' of greater size [C:\compiler\openMSX\build\3rdparty\freetype.vcxproj]
  C:\compiler\openMSX\derived\3rdParty\src\freetype-2.9.1\src\type1\t1driver.c(273,49): warning C4267: '=': conversion from 'size_t' to 'FT_ULong', possible loss of data [C:\compiler\openMSX\build\3rdparty\freetype.vcxproj]
  C:\compiler\openMSX\derived\3rdParty\src\freetype-2.9.1\src\type1\t1driver.c(293,58): warning C4267: '=': conversion from 'size_t' to 'FT_ULong', possible loss of data [C:\compiler\openMSX\build\3rdparty\freetype.vcxproj]
  C:\compiler\openMSX\derived\3rdParty\src\freetype-2.9.1\src\type1\t1driver.c(325,65): warning C4267: '=': conversion from 'size_t' to 'FT_ULong', possible loss of data [C:\compiler\openMSX\build\3rdparty\freetype.vcxproj]
  C:\compiler\openMSX\derived\3rdParty\src\freetype-2.9.1\src\type1\t1driver.c(355,23): warning C4267: '=': conversion from 'size_t' to 'FT_UInt', possible loss of data [C:\compiler\openMSX\build\3rdparty\freetype.vcxproj]
  C:\compiler\openMSX\derived\3rdParty\src\freetype-2.9.1\src\type1\t1driver.c(562,57): warning C4267: '=': conversion from 'size_t' to 'FT_ULong', possible loss of data [C:\compiler\openMSX\build\3rdparty\freetype.vcxproj]
  C:\compiler\openMSX\derived\3rdParty\src\freetype-2.9.1\src\type1\t1driver.c(568,56): warning C4267: '=': conversion from 'size_t' to 'FT_ULong', possible loss of data [C:\compiler\openMSX\build\3rdparty\freetype.vcxproj]
  C:\compiler\openMSX\derived\3rdParty\src\freetype-2.9.1\src\type1\t1driver.c(574,59): warning C4267: '=': conversion from 'size_t' to 'FT_ULong', possible loss of data [C:\compiler\openMSX\build\3rdparty\freetype.vcxproj]
  C:\compiler\openMSX\derived\3rdParty\src\freetype-2.9.1\src\type1\t1driver.c(580,61): warning C4267: '=': conversion from 'size_t' to 'FT_ULong', possible loss of data [C:\compiler\openMSX\build\3rdparty\freetype.vcxproj]
  C:\compiler\openMSX\derived\3rdParty\src\freetype-2.9.1\src\type1\t1driver.c(586,56): warning C4267: '=': conversion from 'size_t' to 'FT_ULong', possible loss of data [C:\compiler\openMSX\build\3rdparty\freetype.vcxproj]
  C:\compiler\openMSX\derived\3rdParty\src\freetype-2.9.1\src\type1\t1load.c(1581,68): warning C4244: '=': conversion from '__int64' to 'FT_Int', possible loss of data [C:\compiler\openMSX\build\3rdparty\freetype.vcxproj]
  C:\compiler\openMSX\derived\3rdParty\src\freetype-2.9.1\src\type1\t1load.c(1742,40): warning C4244: '=': conversion from '__int64' to 'FT_Int', possible loss of data [C:\compiler\openMSX\build\3rdparty\freetype.vcxproj]
  C:\compiler\openMSX\derived\3rdParty\src\freetype-2.9.1\src\type42\t42parse.c(821,66): warning C4244: '=': conversion from '__int64' to 'FT_Int', possible loss of data [C:\compiler\openMSX\build\3rdparty\freetype.vcxproj]


"C:\compiler\openMSX\build\3rdparty\3rdparty.sln" (default target) (1) ->
"C:\compiler\openMSX\build\3rdparty\SDL_ttf.vcxproj" (default target) (9) ->
  C:\compiler\openMSX\derived\3rdParty\src\SDL2_ttf-2.0.15\SDL_ttf.c(602,38): warning C4244: '+=': conversion from 'float' to 'int', possible loss of data [C:\compiler\openMSX\build\3rdparty\SDL_ttf.vcxproj]
  C:\compiler\openMSX\derived\3rdParty\src\SDL2_ttf-2.0.15\SDL_ttf.c(603,38): warning C4244: '+=': conversion from 'float' to 'int', possible loss of data [C:\compiler\openMSX\build\3rdparty\SDL_ttf.vcxproj]
  C:\compiler\openMSX\derived\3rdParty\src\SDL2_ttf-2.0.15\SDL_ttf.c(1949,55): warning C4018: '>': signed/unsigned mismatch [C:\compiler\openMSX\build\3rdparty\SDL_ttf.vcxproj]

    20 Warning(s)
    0 Error(s)

Time Elapsed 00:00:09.45
Back To Top

64 bit compile

Microsoft (R) Build Engine version 16.3.1+1def00d3d for .NET Framework
Copyright (C) Microsoft Corporation. All rights reserved.

Building the projects in this solution one at a time. To enable parallel build, please add the "-m" switch.
Build started 10/13/2019 11:15:33 AM.
Project "C:\compiler\openMSX\build\msvc\openmsx.sln" on node 1 (default targets).
ValidateSolutionConfiguration:
  Building solution configuration "Release|x64".
Project "C:\compiler\openMSX\build\msvc\openmsx.sln" (1) is building "C:\compiler\openMSX\build\msvc\openmsx.vcxproj" (2) on node 1 (default targets).
InitializeBuildStatus:
  Touching "..\..\derived\x64-VC-Release\build\openmsx.tlog\unsuccessfulbuild".
CustomBuild:
  Generating config headers...
  Up to date: C:\compiler\openMSX\derived\x64-VC-Release\config\build-info.hh
  Up to date: C:\compiler\openMSX\derived\x64-VC-Release\config\components.hh
  Up to date: C:\compiler\openMSX\derived\x64-VC-Release\config\systemfuncs.hh
  Updating C:\compiler\openMSX\derived\x64-VC-Release\config\resource-info.h...
  Updating C:\compiler\openMSX\derived\x64-VC-Release\config\version.ii...
ClCompile:
  C:\Program Files (x86)\Microsoft Visual Studio\2019\Professional\VC\Tools\MSVC\14.23.28105\bin\HostX64\x64\CL.exe /c /I"..\..\derived\x64-VC-Release\config" /I\Include /I"..\..\derived\3rdParty\src\freetype-2.9.1" /I"..\..\derived\3rdParty\src\glew-2.1.0\include" /I"..\..\derived\3rdParty\src\libpng-1.6.36" /I"..\..\derived\3rdParty\src\SDL2-2.0.10\include" /I"..\..\derived\3rdParty\src\SDL2_ttf-2.0.15" /I"..\..\derived\3rdParty\src\libtheora-1.1.1\include" /I"..\..\derived\3rdParty\src\libvorbis-1.3.6\include" /I"..\..\derived\3rdParty\src\libogg-1.3.3\include" /I..\..\derived\3rdParty\src\tcl8.6.9\generic /I"..\..\derived\3rdParty\src\zlib-1.2.11" /I..\..\src /I..\..\src\cassette /I..\..\src\commands /I..\..\src\config /I..\..\src\console /I..\..\src\cpu /I..\..\src\debugger /I..\..\src\events /I..\..\src\fdc /I..\..\src\file /I..\..\src\ide /I..\..\src\input /I..\..\src\laserdisc /I..\..\src\memory /I..\..\src\resource /I..\..\src\security /I..\..\src\serial /I..\..\src\settings /I..\..\src\sound /I..\..\src\thread /I..\..\src\utils /I..\..\src\video /I..\..\src\video\scalers /I..\..\src\video\ld /I..\..\src\video\v9990 /Zi /nologo /W4 /WX- /diagnostics:column /Ox /Ob2 /Oi /Os /Oy /GT /GL /D __SSE__ /D __SSE2__ /D WIN32 /D _WIN64 /D __x86_64 /D WIN32_LEAN_AND_MEAN /D UNICODE /D _UNICODE /D SECURITY_WIN32 /D NDEBUG /D _CONSOLE /D _USE_MATH_DEFINES /D _CRT_SECURE_NO_WARNINGS /D _CRT_NONSTDC_NO_DEPRECATE /D NOMINMAX /D GLEW_STATIC /D STATIC_BUILD /D _UNICODE /D UNICODE /GF /Gm- /EHsc /MT /GS /Gy /fp:precise /Zc:wchar_t /Zc:forScope /Zc:inline /std:c++17 /Fo"..\..\derived\x64-VC-Release\build\\" /Fd"..\..\derived\x64-VC-Release\build\vc142.pdb" /Gd /TP /wd4324 /wd4063 /wd4121 /wd4125 /wd4127 /wd4189 /wd4201 /wd4244 /wd4310 /wd4355 /wd4505 /wd4512 /wd4611 /wd4702 /FC /errorReport:queue /constexpr:steps20000000 /MP ..\..\src\commands\Completer.cc ..\..\src\commands\GlobalCommandController.cc ..\..\src\commands\TclCallback.cc ..\..\src\console\CommandConsole.cc ..\..\src\console\OSDConsoleRenderer.cc ..\..\src\cpu\CPUClock.cc ..\..\src\events\AdhocCliCommParser.cc ..\..\src\events\AfterCommand.cc ..\..\src\events\CliComm.cc ..\..\src\events\InputEventGenerator.cc ..\..\src\events\InputEvents.cc ..\..\src\events\Keys.cc ..\..\src\events\MSXCliComm.cc ..\..\src\fdc\Disk.cc ..\..\src\fdc\NowindRomDisk.cc ..\..\src\file\FileContext.cc ..\..\src\file\FileOperations.cc ..\..\src\file\FilePool.cc ..\..\src\ide\IDEDeviceFactory.cc ..\..\src\input\MSXEventDistributor.cc ..\..\src\input\UnicodeKeymap.cc ..\..\src\memory\ColecoSuperGameModule.cc ..\..\src\memory\RomGeneric8kB.cc ..\..\src\memory\RomNettouYakyuu.cc ..\..\src\memory\ROMHunterMk2.cc ..\..\src\sound\AY8910.cc ..\..\src\sound\BlipBuffer.cc ..\..\src\sound\MSXYamahaSFG.cc ..\..\src\sound\SCC.cc ..\..\src\sound\SN76489.cc ..\..\src\sound\VLM5030.cc ..\..\src\sound\Y8950.cc ..\..\src\sound\Y8950KeyboardDevice.cc ..\..\src\sound\YM2151.cc ..\..\src\sound\YM2413.cc ..\..\src\sound\YM2413Burczynski.cc ..\..\src\sound\YM2413Okazaki.cc ..\..\src\sound\YMF262.cc ..\..\src\utils\utf8_checked.cc ..\..\src\video\PNG.cc ..\..\src\video\VDPCmdEngine.cc ..\..\src\serial\RS232Connector.cc ..\..\src\security\SspiUtils.cc ..\..\src\laserdisc\LaserdiscPlayer.cc ..\..\src\Autofire.cc ..\..\src\PluggableFactory.cc ..\..\src\ThrottleManager.cc ..\..\src\Version.cc ..\..\src\MSXCielTurbo.cc
  Completer.cc
  GlobalCommandController.cc
  TclCallback.cc
  CommandConsole.cc
  OSDConsoleRenderer.cc
  CPUClock.cc
  AdhocCliCommParser.cc
  AfterCommand.cc
  CliComm.cc
  InputEventGenerator.cc
  InputEvents.cc
  Keys.cc
C:\Program Files (x86)\Windows Kits\10\Include\10.0.17763.0\ucrt\corecrt_math_defines.h(22,1): warning C4005: 'M_PI': macro redefinition [C:\compiler\openMSX\build\msvc\openmsx.vcxproj]
  MSXCliComm.cc
  Disk.cc
  NowindRomDisk.cc
  FileContext.cc
  FileOperations.cc
C:\compiler\openMSX\derived\3rdParty\src\SDL2-2.0.10\include\SDL_stdinc.h(499): message : see previous definition of 'M_PI' [C:\compiler\openMSX\build\msvc\openmsx.vcxproj]
C:\compiler\openMSX\src\file\FileOperations.cc(240,19): error C2039: 'startWith': is not a member of 'StringOp' [C:\compiler\openMSX\build\msvc\openmsx.vcxproj]
C:\compiler\openMSX\src\utils\StringOp.hh(16): message : see declaration of 'StringOp' [C:\compiler\openMSX\build\msvc\openmsx.vcxproj]
  FilePool.cc
  IDEDeviceFactory.cc
  MSXEventDistributor.cc
  Compiling...
  UnicodeKeymap.cc
  ColecoSuperGameModule.cc
  RomGeneric8kB.cc
  RomNettouYakyuu.cc
  ROMHunterMk2.cc
  AY8910.cc
  BlipBuffer.cc
  MSXYamahaSFG.cc
  SCC.cc
  SN76489.cc
  VLM5030.cc
  Y8950.cc
  Y8950KeyboardDevice.cc
  YM2151.cc
  YM2413.cc
  YM2413Burczynski.cc
  YM2413Okazaki.cc
  YMF262.cc
  utf8_checked.cc
  PNG.cc
  Compiling...
  VDPCmdEngine.cc
  RS232Connector.cc
  SspiUtils.cc
  LaserdiscPlayer.cc
  Autofire.cc
  PluggableFactory.cc
  ThrottleManager.cc
  Version.cc
  MSXCielTurbo.cc
C:\compiler\openMSX\src\file\FileOperations.cc(240,28): error C3861: 'startWith': identifier not found [C:\compiler\openMSX\build\msvc\openmsx.vcxproj]
Done Building Project "C:\compiler\openMSX\build\msvc\openmsx.vcxproj" (default targets) -- FAILED.
Done Building Project "C:\compiler\openMSX\build\msvc\openmsx.sln" (default targets) -- FAILED.

Build FAILED.

"C:\compiler\openMSX\build\msvc\openmsx.sln" (default target) (1) ->
"C:\compiler\openMSX\build\msvc\openmsx.vcxproj" (default target) (2) ->
(ClCompile target) -> 
  C:\Program Files (x86)\Windows Kits\10\Include\10.0.17763.0\ucrt\corecrt_math_defines.h(22,1): warning C4005: 'M_PI': macro redefinition [C:\compiler\openMSX\build\msvc\openmsx.vcxproj]


"C:\compiler\openMSX\build\msvc\openmsx.sln" (default target) (1) ->
"C:\compiler\openMSX\build\msvc\openmsx.vcxproj" (default target) (2) ->
(ClCompile target) -> 
  C:\compiler\openMSX\src\file\FileOperations.cc(240,19): error C2039: 'startWith': is not a member of 'StringOp' [C:\compiler\openMSX\build\msvc\openmsx.vcxproj]
  C:\compiler\openMSX\src\file\FileOperations.cc(240,28): error C3861: 'startWith': identifier not found [C:\compiler\openMSX\build\msvc\openmsx.vcxproj]

    1 Warning(s)
    2 Error(s)

Time Elapsed 00:03:58.32
Back To Top
**********************************************************************
** Visual Studio 2019 Developer Command Prompt v16.3.4
** Copyright (c) 2019 Microsoft Corporation
**********************************************************************
[vcvarsall.bat] Environment initialized for: 'x86'

32 bit 3rd party

Microsoft (R) Build Engine version 16.3.1+1def00d3d for .NET Framework
Copyright (C) Microsoft Corporation. All rights reserved.

Building the projects in this solution one at a time. To enable parallel build, please add the "-m" switch.
Build started 10/13/2019 11:19:38 AM.
Project "C:\compiler\openMSX\build\3rdparty\3rdparty.sln" on node 1 (default targets).
ValidateSolutionConfiguration:
  Building solution configuration "Release|Win32".
Project "C:\compiler\openMSX\build\3rdparty\3rdparty.sln" (1) is building "C:\compiler\openMSX\build\3rdparty\glew.vcxproj" (2) on node 1 (default targets).
InitializeBuildStatus:
  Creating "..\..\derived\Win32-VC-Release\3rdParty\build\glew-2.1.0\glew.tlog\unsuccessfulbuild" because "AlwaysCreate" was specified.
ClCompile:
  All outputs are up-to-date.
ResourceCompile:
  All outputs are up-to-date.
Lib:
  All outputs are up-to-date.
  glew.vcxproj -> C:\compiler\openMSX\build\3rdparty\..\..\derived\Win32-VC-Release\3rdParty\install\lib\glew.lib
FinalizeBuildStatus:
  Deleting file "..\..\derived\Win32-VC-Release\3rdParty\build\glew-2.1.0\glew.tlog\unsuccessfulbuild".
  Touching "..\..\derived\Win32-VC-Release\3rdParty\build\glew-2.1.0\glew.tlog\glew.lastbuildstate".
Done Building Project "C:\compiler\openMSX\build\3rdparty\glew.vcxproj" (default targets).
Project "C:\compiler\openMSX\build\3rdparty\3rdparty.sln" (1) is building "C:\compiler\openMSX\build\3rdparty\freetype.vcxproj" (3) on node 1 (default targets).
InitializeBuildStatus:
  Creating "..\..\derived\Win32-VC-Release\3rdParty\build\freetype-2.9.1\freetype.tlog\unsuccessfulbuild" because "AlwaysCreate" was specified.
ClCompile:
  C:\Program Files (x86)\Microsoft Visual Studio\2019\Professional\VC\Tools\MSVC\14.23.28105\bin\HostX86\x86\CL.exe /c /I"..\..\derived\3rdParty\src\freetype-2.9.1\include" /nologo /W4 /WX- /diagnostics:column /Ox /Ob2 /Oi /Os /Oy /GT /GL /D NDEBUG /D WIN32 /D _LIB /D FT2_BUILD_LIBRARY /D _CRT_SECURE_NO_WARNINGS /D _VC80_UPGRADE=0x0710 /D _MBCS /GF /Gm- /EHsc /MT /GS /Gy /fp:precise /Za /Zc:wchar_t /Zc:forScope /Zc:inline /Fo"..\..\derived\Win32-VC-Release\3rdParty\build\freetype-2.9.1\\" /Fd"..\..\derived\Win32-VC-Release\3rdParty\build\freetype-2.9.1\freetype.pdb" /Gd /TC /wd4001 /analyze- /FC /errorReport:queue "..\..\derived\3rdParty\src\freetype-2.9.1\src\autofit\autofit.c" "..\..\derived\3rdParty\src\freetype-2.9.1\src\base\ftbbox.c" "..\..\derived\3rdParty\src\freetype-2.9.1\src\base\ftbitmap.c" "..\..\derived\3rdParty\src\freetype-2.9.1\src\base\ftgasp.c" "..\..\derived\3rdParty\src\freetype-2.9.1\src\base\ftpfr.c" "..\..\derived\3rdParty\src\freetype-2.9.1\src\base\ftstroke.c" "..\..\derived\3rdParty\src\freetype-2.9.1\src\base\ftsynth.c" "..\..\derived\3rdParty\src\freetype-2.9.1\src\base\fttype1.c" "..\..\derived\3rdParty\src\freetype-2.9.1\src\base\ftwinfnt.c"
  autofit.c
  ftbbox.c
  ftbitmap.c
  ftgasp.c
  ftpfr.c
  ftstroke.c
  ftsynth.c
  fttype1.c
  ftwinfnt.c
  C:\Program Files (x86)\Microsoft Visual Studio\2019\Professional\VC\Tools\MSVC\14.23.28105\bin\HostX86\x86\CL.exe /c /I"..\..\derived\3rdParty\src\freetype-2.9.1\include" /nologo /W4 /WX- /diagnostics:column /O2 /Ob2 /Oi /Os /Oy /GT /GL /D NDEBUG /D WIN32 /D _LIB /D FT2_BUILD_LIBRARY /D _CRT_SECURE_NO_WARNINGS /D _VC80_UPGRADE=0x0710 /D _MBCS /GF /Gm- /EHsc /MT /GS /Gy /fp:precise /Za /Zc:wchar_t /Zc:forScope /Zc:inline /Fo"..\..\derived\Win32-VC-Release\3rdParty\build\freetype-2.9.1\\" /Fd"..\..\derived\Win32-VC-Release\3rdParty\build\freetype-2.9.1\freetype.pdb" /Gd /TC /wd4001 /analyze- /FC /errorReport:queue "..\..\derived\3rdParty\src\freetype-2.9.1\src\base\ftbase.c" "..\..\derived\3rdParty\src\freetype-2.9.1\src\base\ftglyph.c" "..\..\derived\3rdParty\src\freetype-2.9.1\src\base\ftinit.c" "..\..\derived\3rdParty\src\freetype-2.9.1\src\base\ftmm.c" "..\..\derived\3rdParty\src\freetype-2.9.1\src\base\ftsystem.c" "..\..\derived\3rdParty\src\freetype-2.9.1\src\bdf\bdf.c" "..\..\derived\3rdParty\src\freetype-2.9.1\src\cache\ftcache.c" "..\..\derived\3rdParty\src\freetype-2.9.1\src\cff\cff.c" "..\..\derived\3rdParty\src\freetype-2.9.1\src\cid\type1cid.c" "..\..\derived\3rdParty\src\freetype-2.9.1\src\gzip\ftgzip.c" "..\..\derived\3rdParty\src\freetype-2.9.1\src\lzw\ftlzw.c" "..\..\derived\3rdParty\src\freetype-2.9.1\src\pcf\pcf.c" "..\..\derived\3rdParty\src\freetype-2.9.1\src\pfr\pfr.c" "..\..\derived\3rdParty\src\freetype-2.9.1\src\psaux\psaux.c" "..\..\derived\3rdParty\src\freetype-2.9.1\src\pshinter\pshinter.c" "..\..\derived\3rdParty\src\freetype-2.9.1\src\psnames\psmodule.c" "..\..\derived\3rdParty\src\freetype-2.9.1\src\raster\raster.c" "..\..\derived\3rdParty\src\freetype-2.9.1\src\sfnt\sfnt.c" "..\..\derived\3rdParty\src\freetype-2.9.1\src\smooth\smooth.c" "..\..\derived\3rdParty\src\freetype-2.9.1\src\truetype\truetype.c" "..\..\derived\3rdParty\src\freetype-2.9.1\src\type1\type1.c" "..\..\derived\3rdParty\src\freetype-2.9.1\src\type42\type42.c" "..\..\derived\3rdParty\src\freetype-2.9.1\src\winfonts\winfnt.c"
  ftbase.c
  ftglyph.c
  ftinit.c
  ftmm.c
  ftsystem.c
  bdf.c
  ftcache.c
  cff.c
  type1cid.c
  ftgzip.c
  ftlzw.c
  pcf.c
  pfr.c
  psaux.c
  pshinter.c
  psmodule.c
  raster.c
  sfnt.c
  smooth.c
  truetype.c
  Compiling...
  type1.c
  type42.c
  winfnt.c
  C:\Program Files (x86)\Microsoft Visual Studio\2019\Professional\VC\Tools\MSVC\14.23.28105\bin\HostX86\x86\CL.exe /c /I"..\..\derived\3rdParty\src\freetype-2.9.1\include" /nologo /W4 /WX- /diagnostics:column /O2 /Ob2 /Oi /Os /Oy /GT /GL /D NDEBUG /D WIN32 /D _LIB /D FT2_BUILD_LIBRARY /D _CRT_SECURE_NO_WARNINGS /D _VC80_UPGRADE=0x0710 /D _MBCS /GF /Gm- /EHsc /MT /GS /Gy /fp:precise /Zc:wchar_t /Zc:forScope /Zc:inline /Fo"..\..\derived\Win32-VC-Release\3rdParty\build\freetype-2.9.1\\" /Fd"..\..\derived\Win32-VC-Release\3rdParty\build\freetype-2.9.1\freetype.pdb" /Gd /TC /wd4001 /analyze- /FC /errorReport:queue "..\..\derived\3rdParty\src\freetype-2.9.1\builds\windows\ftdebug.c"
  ftdebug.c
Lib:
  C:\Program Files (x86)\Microsoft Visual Studio\2019\Professional\VC\Tools\MSVC\14.23.28105\bin\HostX86\x86\Lib.exe /OUT:"..\..\derived\Win32-VC-Release\3rdParty\install\lib\freetype.lib" /NOLOGO /MACHINE:X86 /LTCG "..\..\derived\Win32-VC-Release\3rdParty\build\freetype-2.9.1\autofit.obj"
  "..\..\derived\Win32-VC-Release\3rdParty\build\freetype-2.9.1\bdf.obj"
  "..\..\derived\Win32-VC-Release\3rdParty\build\freetype-2.9.1\cff.obj"
  "..\..\derived\Win32-VC-Release\3rdParty\build\freetype-2.9.1\ftbase.obj"
  "..\..\derived\Win32-VC-Release\3rdParty\build\freetype-2.9.1\ftbitmap.obj"
  "..\..\derived\Win32-VC-Release\3rdParty\build\freetype-2.9.1\ftcache.obj"
  "..\..\derived\Win32-VC-Release\3rdParty\build\freetype-2.9.1\ftdebug.obj"
  "..\..\derived\Win32-VC-Release\3rdParty\build\freetype-2.9.1\ftgasp.obj"
  "..\..\derived\Win32-VC-Release\3rdParty\build\freetype-2.9.1\ftglyph.obj"
  "..\..\derived\Win32-VC-Release\3rdParty\build\freetype-2.9.1\ftgzip.obj"
  "..\..\derived\Win32-VC-Release\3rdParty\build\freetype-2.9.1\ftinit.obj"
  "..\..\derived\Win32-VC-Release\3rdParty\build\freetype-2.9.1\ftlzw.obj"
  "..\..\derived\Win32-VC-Release\3rdParty\build\freetype-2.9.1\ftstroke.obj"
  "..\..\derived\Win32-VC-Release\3rdParty\build\freetype-2.9.1\ftsystem.obj"
  "..\..\derived\Win32-VC-Release\3rdParty\build\freetype-2.9.1\smooth.obj"
  "..\..\derived\Win32-VC-Release\3rdParty\build\freetype-2.9.1\ftbbox.obj"
  "..\..\derived\Win32-VC-Release\3rdParty\build\freetype-2.9.1\ftmm.obj"
  "..\..\derived\Win32-VC-Release\3rdParty\build\freetype-2.9.1\ftpfr.obj"
  "..\..\derived\Win32-VC-Release\3rdParty\build\freetype-2.9.1\ftsynth.obj"
  "..\..\derived\Win32-VC-Release\3rdParty\build\freetype-2.9.1\fttype1.obj"
  "..\..\derived\Win32-VC-Release\3rdParty\build\freetype-2.9.1\ftwinfnt.obj"
  "..\..\derived\Win32-VC-Release\3rdParty\build\freetype-2.9.1\pcf.obj"
  "..\..\derived\Win32-VC-Release\3rdParty\build\freetype-2.9.1\pfr.obj"
  "..\..\derived\Win32-VC-Release\3rdParty\build\freetype-2.9.1\psaux.obj"
  "..\..\derived\Win32-VC-Release\3rdParty\build\freetype-2.9.1\pshinter.obj"
  "..\..\derived\Win32-VC-Release\3rdParty\build\freetype-2.9.1\psmodule.obj"
  "..\..\derived\Win32-VC-Release\3rdParty\build\freetype-2.9.1\raster.obj"
  "..\..\derived\Win32-VC-Release\3rdParty\build\freetype-2.9.1\sfnt.obj"
  "..\..\derived\Win32-VC-Release\3rdParty\build\freetype-2.9.1\truetype.obj"
  "..\..\derived\Win32-VC-Release\3rdParty\build\freetype-2.9.1\type1.obj"
  "..\..\derived\Win32-VC-Release\3rdParty\build\freetype-2.9.1\type1cid.obj"
  "..\..\derived\Win32-VC-Release\3rdParty\build\freetype-2.9.1\type42.obj"
  "..\..\derived\Win32-VC-Release\3rdParty\build\freetype-2.9.1\winfnt.obj"
  freetype.vcxproj -> C:\compiler\openMSX\build\3rdparty\..\..\derived\Win32-VC-Release\3rdParty\install\lib\freetype.lib
FinalizeBuildStatus:
  Deleting file "..\..\derived\Win32-VC-Release\3rdParty\build\freetype-2.9.1\freetype.tlog\unsuccessfulbuild".
  Touching "..\..\derived\Win32-VC-Release\3rdParty\build\freetype-2.9.1\freetype.tlog\freetype.lastbuildstate".
Done Building Project "C:\compiler\openMSX\build\3rdparty\freetype.vcxproj" (default targets).
Project "C:\compiler\openMSX\build\3rdparty\3rdparty.sln" (1) is building "C:\compiler\openMSX\build\3rdparty\libogg.vcxproj" (4) on node 1 (default targets).
InitializeBuildStatus:
  Creating "..\..\derived\Win32-VC-Release\3rdParty\build\libogg-1.3.3\libogg.tlog\unsuccessfulbuild" because "AlwaysCreate" was specified.
ClCompile:
  All outputs are up-to-date.
Lib:
  All outputs are up-to-date.
  libogg.vcxproj -> C:\compiler\openMSX\build\3rdparty\..\..\derived\Win32-VC-Release\3rdParty\install\lib\libogg.lib
FinalizeBuildStatus:
  Deleting file "..\..\derived\Win32-VC-Release\3rdParty\build\libogg-1.3.3\libogg.tlog\unsuccessfulbuild".
  Touching "..\..\derived\Win32-VC-Release\3rdParty\build\libogg-1.3.3\libogg.tlog\libogg.lastbuildstate".
Done Building Project "C:\compiler\openMSX\build\3rdparty\libogg.vcxproj" (default targets).
Project "C:\compiler\openMSX\build\3rdparty\3rdparty.sln" (1) is building "C:\compiler\openMSX\build\3rdparty\libpng.vcxproj" (5) on node 1 (default targets).
InitializeBuildStatus:
  Creating "..\..\derived\Win32-VC-Release\3rdParty\build\libpng-1.6.36\libpng.tlog\unsuccessfulbuild" because "AlwaysCreate" was specified.
PreBuildEvent:
  copy ..\..\derived\3rdParty\src\libpng-1.6.36\scripts\pnglibconf.h.prebuilt ..\..\derived\3rdParty\src\libpng-1.6.36\pnglibconf.h
  :VCEnd
          1 file(s) copied.
ClCompile:
  All outputs are up-to-date.
ResourceCompile:
  All outputs are up-to-date.
Lib:
  All outputs are up-to-date.
  libpng.vcxproj -> C:\compiler\openMSX\build\3rdparty\..\..\derived\Win32-VC-Release\3rdParty\install\lib\libpng.lib
FinalizeBuildStatus:
  Deleting file "..\..\derived\Win32-VC-Release\3rdParty\build\libpng-1.6.36\libpng.tlog\unsuccessfulbuild".
  Touching "..\..\derived\Win32-VC-Release\3rdParty\build\libpng-1.6.36\libpng.tlog\libpng.lastbuildstate".
Done Building Project "C:\compiler\openMSX\build\3rdparty\libpng.vcxproj" (default targets).
Project "C:\compiler\openMSX\build\3rdparty\3rdparty.sln" (1) is building "C:\compiler\openMSX\build\3rdparty\libtheora.vcxproj" (6) on node 1 (default targets).
InitializeBuildStatus:
  Creating "..\..\derived\Win32-VC-Release\3rdParty\build\libtheora-1.1.1\libtheora.tlog\unsuccessfulbuild" because "AlwaysCreate" was specified.
ClCompile:
  All outputs are up-to-date.
  All outputs are up-to-date.
  All outputs are up-to-date.
  All outputs are up-to-date.
Lib:
  All outputs are up-to-date.
  libtheora.vcxproj -> C:\compiler\openMSX\build\3rdparty\..\..\derived\Win32-VC-Release\3rdParty\install\lib\libtheora.lib
FinalizeBuildStatus:
  Deleting file "..\..\derived\Win32-VC-Release\3rdParty\build\libtheora-1.1.1\libtheora.tlog\unsuccessfulbuild".
  Touching "..\..\derived\Win32-VC-Release\3rdParty\build\libtheora-1.1.1\libtheora.tlog\libtheora.lastbuildstate".
Done Building Project "C:\compiler\openMSX\build\3rdparty\libtheora.vcxproj" (default targets).
Project "C:\compiler\openMSX\build\3rdparty\3rdparty.sln" (1) is building "C:\compiler\openMSX\build\3rdparty\libvorbis.vcxproj" (7) on node 1 (default targets).
InitializeBuildStatus:
  Creating "..\..\derived\Win32-VC-Release\3rdParty\build\libvorbis-1.3.6\libvorbis.tlog\unsuccessfulbuild" because "AlwaysCreate" was specified.
ClCompile:
  All outputs are up-to-date.
Lib:
  All outputs are up-to-date.
  libvorbis.vcxproj -> C:\compiler\openMSX\build\3rdparty\..\..\derived\Win32-VC-Release\3rdParty\install\lib\libvorbis.lib
FinalizeBuildStatus:
  Deleting file "..\..\derived\Win32-VC-Release\3rdParty\build\libvorbis-1.3.6\libvorbis.tlog\unsuccessfulbuild".
  Touching "..\..\derived\Win32-VC-Release\3rdParty\build\libvorbis-1.3.6\libvorbis.tlog\libvorbis.lastbuildstate".
Done Building Project "C:\compiler\openMSX\build\3rdparty\libvorbis.vcxproj" (default targets).
Project "C:\compiler\openMSX\build\3rdparty\3rdparty.sln" (1) is building "C:\compiler\openMSX\build\3rdparty\SDL.vcxproj" (8) on node 1 (default targets).
InitializeBuildStatus:
  Creating "..\..\derived\Win32-VC-Release\3rdParty\build\SDL2-2.0.10\SDL.tlog\unsuccessfulbuild" because "AlwaysCreate" was specified.
ClCompile:
  All outputs are up-to-date.
Lib:
  All outputs are up-to-date.
  SDL.vcxproj -> C:\compiler\openMSX\build\3rdparty\..\..\derived\Win32-VC-Release\3rdParty\install\lib\SDL.lib
FinalizeBuildStatus:
  Deleting file "..\..\derived\Win32-VC-Release\3rdParty\build\SDL2-2.0.10\SDL.tlog\unsuccessfulbuild".
  Touching "..\..\derived\Win32-VC-Release\3rdParty\build\SDL2-2.0.10\SDL.tlog\SDL.lastbuildstate".
Done Building Project "C:\compiler\openMSX\build\3rdparty\SDL.vcxproj" (default targets).
Project "C:\compiler\openMSX\build\3rdparty\3rdparty.sln" (1) is building "C:\compiler\openMSX\build\3rdparty\SDL_ttf.vcxproj" (9) on node 1 (default targets).
InitializeBuildStatus:
  Creating "..\..\derived\Win32-VC-Release\3rdParty\build\SDL2_ttf-2.0.15\SDL_ttf.tlog\unsuccessfulbuild" because "AlwaysCreate" was specified.
ClCompile:
  C:\Program Files (x86)\Microsoft Visual Studio\2019\Professional\VC\Tools\MSVC\14.23.28105\bin\HostX86\x86\CL.exe /c /I"..\..\derived\3rdParty\src\SDL2-2.0.10\include" /I"..\..\derived\3rdParty\src\freetype-2.9.1\include" /Zi /nologo /W3 /WX- /diagnostics:column /Ox /Ob2 /Oi /Os /Oy /GT /GL /D WIN32 /D NDEBUG /D _WINDOWS /D _VC80_UPGRADE=0x0600 /GF /Gm- /EHsc /MT /GS /Gy /fp:precise /Zc:wchar_t /Zc:forScope /Zc:inline /Fo"..\..\derived\Win32-VC-Release\3rdParty\build\SDL2_ttf-2.0.15\\" /Fd"..\..\derived\Win32-VC-Release\3rdParty\build\SDL2_ttf-2.0.15\SDL_ttf.pdb" /Gd /TC /analyze- /FC /errorReport:queue "..\..\derived\3rdParty\src\SDL2_ttf-2.0.15\SDL_ttf.c"
  SDL_ttf.c
C:\compiler\openMSX\derived\3rdParty\src\SDL2_ttf-2.0.15\SDL_ttf.c(602,38): warning C4244: '+=': conversion from 'float' to 'int', possible loss of data [C:\compiler\openMSX\build\3rdparty\SDL_ttf.vcxproj]
C:\compiler\openMSX\derived\3rdParty\src\SDL2_ttf-2.0.15\SDL_ttf.c(603,38): warning C4244: '+=': conversion from 'float' to 'int', possible loss of data [C:\compiler\openMSX\build\3rdparty\SDL_ttf.vcxproj]
C:\compiler\openMSX\derived\3rdParty\src\SDL2_ttf-2.0.15\SDL_ttf.c(1949,55): warning C4018: '>': signed/unsigned mismatch [C:\compiler\openMSX\build\3rdparty\SDL_ttf.vcxproj]
Lib:
  C:\Program Files (x86)\Microsoft Visual Studio\2019\Professional\VC\Tools\MSVC\14.23.28105\bin\HostX86\x86\Lib.exe /OUT:"..\..\derived\Win32-VC-Release\3rdParty\install\lib\SDL_ttf.lib" /NOLOGO /MACHINE:X86 /LTCG "..\..\derived\Win32-VC-Release\3rdParty\build\SDL2_ttf-2.0.15\SDL_ttf.obj"
  SDL_ttf.vcxproj -> C:\compiler\openMSX\build\3rdparty\..\..\derived\Win32-VC-Release\3rdParty\install\lib\SDL_ttf.lib
FinalizeBuildStatus:
  Deleting file "..\..\derived\Win32-VC-Release\3rdParty\build\SDL2_ttf-2.0.15\SDL_ttf.tlog\unsuccessfulbuild".
  Touching "..\..\derived\Win32-VC-Release\3rdParty\build\SDL2_ttf-2.0.15\SDL_ttf.tlog\SDL_ttf.lastbuildstate".
Done Building Project "C:\compiler\openMSX\build\3rdparty\SDL_ttf.vcxproj" (default targets).
Project "C:\compiler\openMSX\build\3rdparty\3rdparty.sln" (1) is building "C:\compiler\openMSX\build\3rdparty\SDLmain.vcxproj" (10) on node 1 (default targets).
InitializeBuildStatus:
  Creating "..\..\derived\Win32-VC-Release\3rdParty\build\SDLmain\SDLmain.tlog\unsuccessfulbuild" because "AlwaysCreate" was specified.
ClCompile:
  All outputs are up-to-date.
Lib:
  All outputs are up-to-date.
  SDLmain.vcxproj -> C:\compiler\openMSX\build\3rdparty\..\..\derived\Win32-VC-Release\3rdParty\install\lib\SDLmain.lib
FinalizeBuildStatus:
  Deleting file "..\..\derived\Win32-VC-Release\3rdParty\build\SDLmain\SDLmain.tlog\unsuccessfulbuild".
  Touching "..\..\derived\Win32-VC-Release\3rdParty\build\SDLmain\SDLmain.tlog\SDLmain.lastbuildstate".
Done Building Project "C:\compiler\openMSX\build\3rdparty\SDLmain.vcxproj" (default targets).
Project "C:\compiler\openMSX\build\3rdparty\3rdparty.sln" (1) is building "C:\compiler\openMSX\build\3rdparty\tcl.vcxproj" (11) on node 1 (default targets).
InitializeBuildStatus:
  Creating "..\..\derived\Win32-VC-Release\3rdParty\build\tcl8.6.9\tcl.tlog\unsuccessfulbuild" because "AlwaysCreate" was specified.
ClCompile:
  All outputs are up-to-date.
Lib:
  All outputs are up-to-date.
  tcl.vcxproj -> C:\compiler\openMSX\build\3rdparty\..\..\derived\Win32-VC-Release\3rdParty\install\lib\tcl.lib
FinalizeBuildStatus:
  Deleting file "..\..\derived\Win32-VC-Release\3rdParty\build\tcl8.6.9\tcl.tlog\unsuccessfulbuild".
  Touching "..\..\derived\Win32-VC-Release\3rdParty\build\tcl8.6.9\tcl.tlog\tcl.lastbuildstate".
Done Building Project "C:\compiler\openMSX\build\3rdparty\tcl.vcxproj" (default targets).
Project "C:\compiler\openMSX\build\3rdparty\3rdparty.sln" (1) is building "C:\compiler\openMSX\build\3rdparty\zlib.vcxproj" (12) on node 1 (default targets).
InitializeBuildStatus:
  Creating "..\..\derived\Win32-VC-Release\3rdParty\build\zlib-1.2.11\zlib.tlog\unsuccessfulbuild" because "AlwaysCreate" was specified.
ClCompile:
  All outputs are up-to-date.
ResourceCompile:
  All outputs are up-to-date.
Lib:
  All outputs are up-to-date.
  zlib.vcxproj -> C:\compiler\openMSX\build\3rdparty\..\..\derived\Win32-VC-Release\3rdParty\install\lib\zlib.lib
FinalizeBuildStatus:
  Deleting file "..\..\derived\Win32-VC-Release\3rdParty\build\zlib-1.2.11\zlib.tlog\unsuccessfulbuild".
  Touching "..\..\derived\Win32-VC-Release\3rdParty\build\zlib-1.2.11\zlib.tlog\zlib.lastbuildstate".
Done Building Project "C:\compiler\openMSX\build\3rdparty\zlib.vcxproj" (default targets).
Done Building Project "C:\compiler\openMSX\build\3rdparty\3rdparty.sln" (default targets).

Build succeeded.

"C:\compiler\openMSX\build\3rdparty\3rdparty.sln" (default target) (1) ->
"C:\compiler\openMSX\build\3rdparty\SDL_ttf.vcxproj" (default target) (9) ->
(ClCompile target) -> 
  C:\compiler\openMSX\derived\3rdParty\src\SDL2_ttf-2.0.15\SDL_ttf.c(602,38): warning C4244: '+=': conversion from 'float' to 'int', possible loss of data [C:\compiler\openMSX\build\3rdparty\SDL_ttf.vcxproj]
  C:\compiler\openMSX\derived\3rdParty\src\SDL2_ttf-2.0.15\SDL_ttf.c(603,38): warning C4244: '+=': conversion from 'float' to 'int', possible loss of data [C:\compiler\openMSX\build\3rdparty\SDL_ttf.vcxproj]
  C:\compiler\openMSX\derived\3rdParty\src\SDL2_ttf-2.0.15\SDL_ttf.c(1949,55): warning C4018: '>': signed/unsigned mismatch [C:\compiler\openMSX\build\3rdparty\SDL_ttf.vcxproj]

    3 Warning(s)
    0 Error(s)

Time Elapsed 00:00:10.02
Back To Top

32 bit compile

Microsoft (R) Build Engine version 16.3.1+1def00d3d for .NET Framework
Copyright (C) Microsoft Corporation. All rights reserved.

Building the projects in this solution one at a time. To enable parallel build, please add the "-m" switch.
Build started 10/13/2019 11:19:48 AM.
Project "C:\compiler\openMSX\build\msvc\openmsx.sln" on node 1 (default targets).
ValidateSolutionConfiguration:
  Building solution configuration "Release|Win32".
Project "C:\compiler\openMSX\build\msvc\openmsx.sln" (1) is building "C:\compiler\openMSX\build\msvc\openmsx.vcxproj" (2) on node 1 (default targets).
InitializeBuildStatus:
  Touching "..\..\derived\Win32-VC-Release\build\openmsx.tlog\unsuccessfulbuild".
CustomBuild:
  Generating config headers...
  Up to date: C:\compiler\openMSX\derived\Win32-VC-Release\config\build-info.hh
  Up to date: C:\compiler\openMSX\derived\Win32-VC-Release\config\components.hh
  Up to date: C:\compiler\openMSX\derived\Win32-VC-Release\config\systemfuncs.hh
  Updating C:\compiler\openMSX\derived\Win32-VC-Release\config\resource-info.h...
  Updating C:\compiler\openMSX\derived\Win32-VC-Release\config\version.ii...
ClCompile:
  C:\Program Files (x86)\Microsoft Visual Studio\2019\Professional\VC\Tools\MSVC\14.23.28105\bin\HostX64\x86\CL.exe /c /I"..\..\derived\Win32-VC-Release\config" /I\Include /I"..\..\derived\3rdParty\src\freetype-2.9.1" /I"..\..\derived\3rdParty\src\glew-2.1.0\include" /I"..\..\derived\3rdParty\src\libpng-1.6.36" /I"..\..\derived\3rdParty\src\SDL2-2.0.10\include" /I"..\..\derived\3rdParty\src\SDL2_ttf-2.0.15" /I"..\..\derived\3rdParty\src\libtheora-1.1.1\include" /I"..\..\derived\3rdParty\src\libvorbis-1.3.6\include" /I"..\..\derived\3rdParty\src\libogg-1.3.3\include" /I..\..\derived\3rdParty\src\tcl8.6.9\generic /I"..\..\derived\3rdParty\src\zlib-1.2.11" /I..\..\src /I..\..\src\cassette /I..\..\src\commands /I..\..\src\config /I..\..\src\console /I..\..\src\cpu /I..\..\src\debugger /I..\..\src\events /I..\..\src\fdc /I..\..\src\file /I..\..\src\ide /I..\..\src\input /I..\..\src\laserdisc /I..\..\src\memory /I..\..\src\resource /I..\..\src\security /I..\..\src\serial /I..\..\src\settings /I..\..\src\sound /I..\..\src\thread /I..\..\src\utils /I..\..\src\video /I..\..\src\video\scalers /I..\..\src\video\ld /I..\..\src\video\v9990 /Zi /nologo /W4 /WX- /diagnostics:column /Ox /Ob2 /Oi /Os /Oy /GT /GL /D __SSE__ /D __SSE2__ /D WIN32 /D WIN32_LEAN_AND_MEAN /D UNICODE /D _UNICODE /D SECURITY_WIN32 /D NDEBUG /D _CONSOLE /D _USE_MATH_DEFINES /D _CRT_SECURE_NO_WARNINGS /D _CRT_NONSTDC_NO_DEPRECATE /D NOMINMAX /D GLEW_STATIC /D STATIC_BUILD /D _UNICODE /D UNICODE /GF /Gm- /EHsc /MT /GS /Gy /fp:precise /Zc:wchar_t /Zc:forScope /Zc:inline /std:c++17 /Fo"..\..\derived\Win32-VC-Release\build\\" /Fd"..\..\derived\Win32-VC-Release\build\vc142.pdb" /Gd /TP /wd4324 /wd4063 /wd4121 /wd4125 /wd4127 /wd4189 /wd4201 /wd4244 /wd4310 /wd4355 /wd4505 /wd4512 /wd4611 /wd4702 /analyze- /FC /errorReport:queue /constexpr:steps20000000 /MP ..\..\src\commands\Completer.cc ..\..\src\commands\GlobalCommandController.cc ..\..\src\commands\TclCallback.cc ..\..\src\console\CommandConsole.cc ..\..\src\console\OSDConsoleRenderer.cc ..\..\src\cpu\CPUClock.cc ..\..\src\events\AdhocCliCommParser.cc ..\..\src\events\AfterCommand.cc ..\..\src\events\CliComm.cc ..\..\src\events\InputEventGenerator.cc ..\..\src\events\InputEvents.cc ..\..\src\events\Keys.cc ..\..\src\events\MSXCliComm.cc ..\..\src\fdc\Disk.cc ..\..\src\fdc\NowindRomDisk.cc ..\..\src\file\FileContext.cc ..\..\src\file\FileOperations.cc ..\..\src\file\FilePool.cc ..\..\src\ide\IDEDeviceFactory.cc ..\..\src\input\MSXEventDistributor.cc ..\..\src\input\UnicodeKeymap.cc ..\..\src\memory\ColecoSuperGameModule.cc ..\..\src\memory\RomGeneric8kB.cc ..\..\src\memory\RomNettouYakyuu.cc ..\..\src\memory\ROMHunterMk2.cc ..\..\src\sound\AY8910.cc ..\..\src\sound\BlipBuffer.cc ..\..\src\sound\MSXYamahaSFG.cc ..\..\src\sound\SCC.cc ..\..\src\sound\SN76489.cc ..\..\src\sound\VLM5030.cc ..\..\src\sound\Y8950.cc ..\..\src\sound\Y8950KeyboardDevice.cc ..\..\src\sound\YM2151.cc ..\..\src\sound\YM2413.cc ..\..\src\sound\YM2413Burczynski.cc ..\..\src\sound\YM2413Okazaki.cc ..\..\src\sound\YMF262.cc ..\..\src\utils\utf8_checked.cc ..\..\src\video\PNG.cc ..\..\src\video\VDPCmdEngine.cc ..\..\src\serial\RS232Connector.cc ..\..\src\security\SspiUtils.cc ..\..\src\laserdisc\LaserdiscPlayer.cc ..\..\src\Autofire.cc ..\..\src\PluggableFactory.cc ..\..\src\ThrottleManager.cc ..\..\src\Version.cc ..\..\src\MSXCielTurbo.cc
  Completer.cc
  GlobalCommandController.cc
  TclCallback.cc
  CommandConsole.cc
  OSDConsoleRenderer.cc
  CPUClock.cc
  AdhocCliCommParser.cc
  AfterCommand.cc
  CliComm.cc
  InputEventGenerator.cc
  InputEvents.cc
  Keys.cc
C:\Program Files (x86)\Windows Kits\10\Include\10.0.17763.0\ucrt\corecrt_math_defines.h(22,1): warning C4005: 'M_PI': macro redefinition [C:\compiler\openMSX\build\msvc\openmsx.vcxproj]
  MSXCliComm.cc
  Disk.cc
  NowindRomDisk.cc
  FileContext.cc
  FileOperations.cc
C:\compiler\openMSX\derived\3rdParty\src\SDL2-2.0.10\include\SDL_stdinc.h(499): message : see previous definition of 'M_PI' [C:\compiler\openMSX\build\msvc\openmsx.vcxproj]
C:\compiler\openMSX\src\file\FileOperations.cc(240,19): error C2039: 'startWith': is not a member of 'StringOp' [C:\compiler\openMSX\build\msvc\openmsx.vcxproj]
C:\compiler\openMSX\src\utils\StringOp.hh(16): message : see declaration of 'StringOp' [C:\compiler\openMSX\build\msvc\openmsx.vcxproj]
  FilePool.cc
  IDEDeviceFactory.cc
  MSXEventDistributor.cc
  Compiling...
  UnicodeKeymap.cc
  ColecoSuperGameModule.cc
  RomGeneric8kB.cc
  RomNettouYakyuu.cc
  ROMHunterMk2.cc
  AY8910.cc
  BlipBuffer.cc
  MSXYamahaSFG.cc
  SCC.cc
  SN76489.cc
  VLM5030.cc
  Y8950.cc
  Y8950KeyboardDevice.cc
  YM2151.cc