openMSX Compile results



64 Bit 3rd Party results
64 Bit Compile results
32 Bit 3rd Party results
32 Bit Compile results
C:\compiler\openMSX>rem @echo ^64 Bit Compile Catapult^^ C:\compiler\openMSX>rem @echo ^32 Bit Compile Catapult^^ 64 Bit MSI Package
32 Bit MSI Package


3rd party


C:\compiler\openMSX>call "python3" build\\thirdparty_download.py windows 
FreeType version 2.9.1 - already downloaded
Patched: freetype-2.9.1/include/freetype/config/ftoption.h
Patched: freetype-2.9.1/modules.cfg
GLEW version 2.1.0 - already downloaded
Patched: glew-2.1.0/config/Makefile.linux-mingw-w64
libogg version 1.3.3 - already downloaded
libpng version 1.6.36 - already downloaded
SDL2 version 2.0.10 - already downloaded
SDL2_ttf version 2.0.15 - already downloaded
WARNING: Skipping symlink creation: C:\compiler\openMSX\derived\3rdparty\src\SDL2_ttf-2.0.15\Xcode\Frameworks\FreeType.framework\FreeType -> Versions/Current/FreeType: symbolic link privilege not held
WARNING: Skipping symlink creation: C:\compiler\openMSX\derived\3rdparty\src\SDL2_ttf-2.0.15\Xcode\Frameworks\FreeType.framework\Resources -> Versions/Current/Resources: symbolic link privilege not held
WARNING: Skipping symlink creation: C:\compiler\openMSX\derived\3rdparty\src\SDL2_ttf-2.0.15\Xcode\Frameworks\FreeType.framework\Headers -> Versions/Current/Headers: symbolic link privilege not held
WARNING: Skipping symlink creation: C:\compiler\openMSX\derived\3rdparty\src\SDL2_ttf-2.0.15\Xcode\Frameworks\FreeType.framework\Versions\Current -> A: symbolic link privilege not held
Tcl version 8.6.9 - already downloaded
libtheora version 1.1.1 - already downloaded
Patched: libtheora-1.1.1/configure
libvorbis version 1.3.6 - already downloaded
zlib version 1.2.11 - already downloaded
Back To Top
**********************************************************************
** Visual Studio 2019 Developer Command Prompt v16.4.5
** Copyright (c) 2019 Microsoft Corporation
**********************************************************************
[vcvarsall.bat] Environment initialized for: 'x64'

64 bit 3rd party

Microsoft (R) Build Engine version 16.4.0+e901037fe for .NET Framework
Copyright (C) Microsoft Corporation. All rights reserved.

Build started 3/29/2020 10:50:24 AM.
     1>Project "C:\compiler\openMSX\build\3rdparty\3rdparty.sln" on node 1 (default targets).
     1>ValidateSolutionConfiguration:
         Building solution configuration "Release|x64".
     1>Project "C:\compiler\openMSX\build\3rdparty\3rdparty.sln" (1) is building "C:\compiler\openMSX\build\3rdparty\glew.vcxproj" (2) on node 1 (default targets).
     2>InitializeBuildStatus:
         Creating "..\..\derived\x64-VC-Release\3rdParty\build\glew-2.1.0\glew.tlog\unsuccessfulbuild" because "AlwaysCreate" was specified.
     1>Project "C:\compiler\openMSX\build\3rdparty\3rdparty.sln" (1) is building "C:\compiler\openMSX\build\3rdparty\libogg.vcxproj" (3) on node 3 (default targets).
     3>InitializeBuildStatus:
         Creating "..\..\derived\x64-VC-Release\3rdParty\build\libogg-1.3.3\libogg.tlog\unsuccessfulbuild" because "AlwaysCreate" was specified.
       ClCompile:
         All outputs are up-to-date.
     2>ClCompile:
         All outputs are up-to-date.
       ResourceCompile:
         All outputs are up-to-date.
       Lib:
         All outputs are up-to-date.
         glew.vcxproj -> C:\compiler\openMSX\build\3rdparty\..\..\derived\x64-VC-Release\3rdParty\install\lib\glew.lib
       FinalizeBuildStatus:
         Deleting file "..\..\derived\x64-VC-Release\3rdParty\build\glew-2.1.0\glew.tlog\unsuccessfulbuild".
         Touching "..\..\derived\x64-VC-Release\3rdParty\build\glew-2.1.0\glew.tlog\glew.lastbuildstate".
     2>Done Building Project "C:\compiler\openMSX\build\3rdparty\glew.vcxproj" (default targets).
     1>Project "C:\compiler\openMSX\build\3rdparty\3rdparty.sln" (1) is building "C:\compiler\openMSX\build\3rdparty\freetype.vcxproj" (4) on node 2 (default targets).
     4>InitializeBuildStatus:
         Creating "..\..\derived\x64-VC-Release\3rdParty\build\freetype-2.9.1\freetype.tlog\unsuccessfulbuild" because "AlwaysCreate" was specified.
     3>Lib:
         All outputs are up-to-date.
         libogg.vcxproj -> C:\compiler\openMSX\build\3rdparty\..\..\derived\x64-VC-Release\3rdParty\install\lib\libogg.lib
     1>Project "C:\compiler\openMSX\build\3rdparty\3rdparty.sln" (1) is building "C:\compiler\openMSX\build\3rdparty\libtheora.vcxproj" (6) on node 1 (default targets).
     6>InitializeBuildStatus:
         Creating "..\..\derived\x64-VC-Release\3rdParty\build\libtheora-1.1.1\libtheora.tlog\unsuccessfulbuild" because "AlwaysCreate" was specified.
       ClCompile:
         All outputs are up-to-date.
         All outputs are up-to-date.
         All outputs are up-to-date.
         All outputs are up-to-date.
     1>Project "C:\compiler\openMSX\build\3rdparty\3rdparty.sln" (1) is building "C:\compiler\openMSX\build\3rdparty\libpng.vcxproj" (5) on node 4 (default targets).
     5>InitializeBuildStatus:
         Creating "..\..\derived\x64-VC-Release\3rdParty\build\libpng-1.6.36\libpng.tlog\unsuccessfulbuild" because "AlwaysCreate" was specified.
       PreBuildEvent:
         copy ..\..\derived\3rdParty\src\libpng-1.6.36\scripts\pnglibconf.h.prebuilt ..\..\derived\3rdParty\src\libpng-1.6.36\pnglibconf.h
         :VCEnd
     4>ClCompile:
         C:\Program Files (x86)\Microsoft Visual Studio\2019\Professional\VC\Tools\MSVC\14.24.28314\bin\HostX86\x64\CL.exe /c /I"..\..\derived\3rdParty\src\freetype-2.9.1\include" /nologo /W4 /WX- /diagnostics:column /Ox /Ob2 /Oi /Os /Oy /GT /GL /D NDEBUG /D WIN32 /D _LIB /D FT2_BUILD_LIBRARY /D _CRT_SECURE_NO_WARNINGS /D _VC80_UPGRADE=0x0710 /D _MBCS /GF /Gm- /EHsc /MT /GS /Gy /fp:precise /Za /Zc:wchar_t /Zc:forScope /Zc:inline /Fo"..\..\derived\x64-VC-Release\3rdParty\build\freetype-2.9.1\\" /Fd"..\..\derived\x64-VC-Release\3rdParty\build\freetype-2.9.1\freetype.pdb" /Gd /TC /wd4001 /FC /errorReport:queue "..\..\derived\3rdParty\src\freetype-2.9.1\src\autofit\autofit.c" "..\..\derived\3rdParty\src\freetype-2.9.1\src\base\ftbbox.c" "..\..\derived\3rdParty\src\freetype-2.9.1\src\base\ftbitmap.c" "..\..\derived\3rdParty\src\freetype-2.9.1\src\base\ftgasp.c" "..\..\derived\3rdParty\src\freetype-2.9.1\src\base\ftpfr.c" "..\..\derived\3rdParty\src\freetype-2.9.1\src\base\ftstroke.c" "..\..\derived\3rdParty\src\freetype-2.9.1\src\base\ftsynth.c" "..\..\derived\3rdParty\src\freetype-2.9.1\src\base\fttype1.c" "..\..\derived\3rdParty\src\freetype-2.9.1\src\base\ftwinfnt.c"
     3>FinalizeBuildStatus:
         Deleting file "..\..\derived\x64-VC-Release\3rdParty\build\libogg-1.3.3\libogg.tlog\unsuccessfulbuild".
         Touching "..\..\derived\x64-VC-Release\3rdParty\build\libogg-1.3.3\libogg.tlog\libogg.lastbuildstate".
     3>Done Building Project "C:\compiler\openMSX\build\3rdparty\libogg.vcxproj" (default targets).
     6>Lib:
         All outputs are up-to-date.
     5>PreBuildEvent:
                 1 file(s) copied.
     6>Lib:
         libtheora.vcxproj -> C:\compiler\openMSX\build\3rdparty\..\..\derived\x64-VC-Release\3rdParty\install\lib\libtheora.lib
     1>Project "C:\compiler\openMSX\build\3rdparty\3rdparty.sln" (1) is building "C:\compiler\openMSX\build\3rdparty\SDL.vcxproj" (7) on node 3 (default targets).
     7>InitializeBuildStatus:
         Creating "..\..\derived\x64-VC-Release\3rdParty\build\SDL2-2.0.10\SDL.tlog\unsuccessfulbuild" because "AlwaysCreate" was specified.
     6>FinalizeBuildStatus:
         Deleting file "..\..\derived\x64-VC-Release\3rdParty\build\libtheora-1.1.1\libtheora.tlog\unsuccessfulbuild".
         Touching "..\..\derived\x64-VC-Release\3rdParty\build\libtheora-1.1.1\libtheora.tlog\libtheora.lastbuildstate".
     6>Done Building Project "C:\compiler\openMSX\build\3rdparty\libtheora.vcxproj" (default targets).
     1>Project "C:\compiler\openMSX\build\3rdparty\3rdparty.sln" (1) is building "C:\compiler\openMSX\build\3rdparty\SDL_ttf.vcxproj" (8) on node 1 (default targets).
     8>InitializeBuildStatus:
         Creating "..\..\derived\x64-VC-Release\3rdParty\build\SDL2_ttf-2.0.15\SDL_ttf.tlog\unsuccessfulbuild" because "AlwaysCreate" was specified.
     1>Project "C:\compiler\openMSX\build\3rdparty\3rdparty.sln" (1) is building "C:\compiler\openMSX\build\3rdparty\libvorbis.vcxproj" (9) on node 2 (default targets).
     9>InitializeBuildStatus:
         Creating "..\..\derived\x64-VC-Release\3rdParty\build\libvorbis-1.3.6\libvorbis.tlog\unsuccessfulbuild" because "AlwaysCreate" was specified.
     5>ClCompile:
         All outputs are up-to-date.
     9>ClCompile:
         All outputs are up-to-date.
     5>ResourceCompile:
         All outputs are up-to-date.
     8>ClCompile:
         C:\Program Files (x86)\Microsoft Visual Studio\2019\Professional\VC\Tools\MSVC\14.24.28314\bin\HostX86\x64\CL.exe /c /I"..\..\derived\3rdParty\src\SDL2-2.0.10\include" /I"..\..\derived\3rdParty\src\freetype-2.9.1\include" /Zi /nologo /W3 /WX- /diagnostics:column /Ox /Ob2 /Oi /Os /Oy /GT /GL /D WIN32 /D NDEBUG /D _WINDOWS /D _VC80_UPGRADE=0x0600 /GF /Gm- /EHsc /MT /GS /Gy /fp:precise /Zc:wchar_t /Zc:forScope /Zc:inline /Fo"..\..\derived\x64-VC-Release\3rdParty\build\SDL2_ttf-2.0.15\\" /Fd"..\..\derived\x64-VC-Release\3rdParty\build\SDL2_ttf-2.0.15\SDL_ttf.pdb" /Gd /TC /FC /errorReport:queue "..\..\derived\3rdParty\src\SDL2_ttf-2.0.15\SDL_ttf.c"
     9>Lib:
         All outputs are up-to-date.
         libvorbis.vcxproj -> C:\compiler\openMSX\build\3rdparty\..\..\derived\x64-VC-Release\3rdParty\install\lib\libvorbis.lib
       FinalizeBuildStatus:
         Deleting file "..\..\derived\x64-VC-Release\3rdParty\build\libvorbis-1.3.6\libvorbis.tlog\unsuccessfulbuild".
         Touching "..\..\derived\x64-VC-Release\3rdParty\build\libvorbis-1.3.6\libvorbis.tlog\libvorbis.lastbuildstate".
     9>Done Building Project "C:\compiler\openMSX\build\3rdparty\libvorbis.vcxproj" (default targets).
     5>Lib:
         All outputs are up-to-date.
         libpng.vcxproj -> C:\compiler\openMSX\build\3rdparty\..\..\derived\x64-VC-Release\3rdParty\install\lib\libpng.lib
     7>ClCompile:
         All outputs are up-to-date.
     1>Project "C:\compiler\openMSX\build\3rdparty\3rdparty.sln" (1) is building "C:\compiler\openMSX\build\3rdparty\SDLmain.vcxproj" (11) on node 2 (default targets).
    11>InitializeBuildStatus:
         Creating "..\..\derived\x64-VC-Release\3rdParty\build\SDLmain\SDLmain.tlog\unsuccessfulbuild" because "AlwaysCreate" was specified.
       ClCompile:
         All outputs are up-to-date.
       Lib:
         All outputs are up-to-date.
         SDLmain.vcxproj -> C:\compiler\openMSX\build\3rdparty\..\..\derived\x64-VC-Release\3rdParty\install\lib\SDLmain.lib
     1>Project "C:\compiler\openMSX\build\3rdparty\3rdparty.sln" (1) is building "C:\compiler\openMSX\build\3rdparty\tcl.vcxproj" (10) on node 1 (default targets).
    10>InitializeBuildStatus:
         Creating "..\..\derived\x64-VC-Release\3rdParty\build\tcl8.6.9\tcl.tlog\unsuccessfulbuild" because "AlwaysCreate" was specified.
    11>FinalizeBuildStatus:
         Deleting file "..\..\derived\x64-VC-Release\3rdParty\build\SDLmain\SDLmain.tlog\unsuccessfulbuild".
         Touching "..\..\derived\x64-VC-Release\3rdParty\build\SDLmain\SDLmain.tlog\SDLmain.lastbuildstate".
    11>Done Building Project "C:\compiler\openMSX\build\3rdparty\SDLmain.vcxproj" (default targets).
     7>Lib:
         All outputs are up-to-date.
         SDL.vcxproj -> C:\compiler\openMSX\build\3rdparty\..\..\derived\x64-VC-Release\3rdParty\install\lib\SDL.lib
     1>Project "C:\compiler\openMSX\build\3rdparty\3rdparty.sln" (1) is building "C:\compiler\openMSX\build\3rdparty\zlib.vcxproj" (12) on node 2 (default targets).
    12>InitializeBuildStatus:
         Creating "..\..\derived\x64-VC-Release\3rdParty\build\zlib-1.2.11\zlib.tlog\unsuccessfulbuild" because "AlwaysCreate" was specified.
     8>ClCompile:
         SDL_ttf.c
     7>FinalizeBuildStatus:
         Deleting file "..\..\derived\x64-VC-Release\3rdParty\build\SDL2-2.0.10\SDL.tlog\unsuccessfulbuild".
         Touching "..\..\derived\x64-VC-Release\3rdParty\build\SDL2-2.0.10\SDL.tlog\SDL.lastbuildstate".
     7>Done Building Project "C:\compiler\openMSX\build\3rdparty\SDL.vcxproj" (default targets).
    12>ClCompile:
         All outputs are up-to-date.
     4>ClCompile:
         autofit.c
    12>ResourceCompile:
         All outputs are up-to-date.
       Lib:
         All outputs are up-to-date.
         zlib.vcxproj -> C:\compiler\openMSX\build\3rdparty\..\..\derived\x64-VC-Release\3rdParty\install\lib\zlib.lib
       FinalizeBuildStatus:
         Deleting file "..\..\derived\x64-VC-Release\3rdParty\build\zlib-1.2.11\zlib.tlog\unsuccessfulbuild".
         Touching "..\..\derived\x64-VC-Release\3rdParty\build\zlib-1.2.11\zlib.tlog\zlib.lastbuildstate".
    12>Done Building Project "C:\compiler\openMSX\build\3rdparty\zlib.vcxproj" (default targets).
     5>FinalizeBuildStatus:
         Deleting file "..\..\derived\x64-VC-Release\3rdParty\build\libpng-1.6.36\libpng.tlog\unsuccessfulbuild".
         Touching "..\..\derived\x64-VC-Release\3rdParty\build\libpng-1.6.36\libpng.tlog\libpng.lastbuildstate".
     5>Done Building Project "C:\compiler\openMSX\build\3rdparty\libpng.vcxproj" (default targets).
    10>ClCompile:
         All outputs are up-to-date.
     8>C:\compiler\openMSX\derived\3rdParty\src\SDL2_ttf-2.0.15\SDL_ttf.c(602,38): warning C4244: '+=': conversion from 'float' to 'int', possible loss of data [C:\compiler\openMSX\build\3rdparty\SDL_ttf.vcxproj]
     8>C:\compiler\openMSX\derived\3rdParty\src\SDL2_ttf-2.0.15\SDL_ttf.c(603,38): warning C4244: '+=': conversion from 'float' to 'int', possible loss of data [C:\compiler\openMSX\build\3rdparty\SDL_ttf.vcxproj]
       Lib:
         All outputs are up-to-date.
     8>C:\compiler\openMSX\derived\3rdParty\src\SDL2_ttf-2.0.15\SDL_ttf.c(1949,55): warning C4018: '>': signed/unsigned mismatch [C:\compiler\openMSX\build\3rdparty\SDL_ttf.vcxproj]
       Lib:
         tcl.vcxproj -> C:\compiler\openMSX\build\3rdparty\..\..\derived\x64-VC-Release\3rdParty\install\lib\tcl.lib
       FinalizeBuildStatus:
         Deleting file "..\..\derived\x64-VC-Release\3rdParty\build\tcl8.6.9\tcl.tlog\unsuccessfulbuild".
         Touching "..\..\derived\x64-VC-Release\3rdParty\build\tcl8.6.9\tcl.tlog\tcl.lastbuildstate".
    10>Done Building Project "C:\compiler\openMSX\build\3rdparty\tcl.vcxproj" (default targets).
     4>ClCompile:
         ftbbox.c
         ftbitmap.c
     8>Lib:
         C:\Program Files (x86)\Microsoft Visual Studio\2019\Professional\VC\Tools\MSVC\14.24.28314\bin\HostX86\x64\Lib.exe /OUT:"..\..\derived\x64-VC-Release\3rdParty\install\lib\SDL_ttf.lib" /NOLOGO /MACHINE:X64 /LTCG "..\..\derived\x64-VC-Release\3rdParty\build\SDL2_ttf-2.0.15\SDL_ttf.obj"
     4>ClCompile:
         ftgasp.c
         ftpfr.c
         ftstroke.c
         ftsynth.c
         fttype1.c
         ftwinfnt.c
     8>Lib:
         SDL_ttf.vcxproj -> C:\compiler\openMSX\build\3rdparty\..\..\derived\x64-VC-Release\3rdParty\install\lib\SDL_ttf.lib
       FinalizeBuildStatus:
         Deleting file "..\..\derived\x64-VC-Release\3rdParty\build\SDL2_ttf-2.0.15\SDL_ttf.tlog\unsuccessfulbuild".
         Touching "..\..\derived\x64-VC-Release\3rdParty\build\SDL2_ttf-2.0.15\SDL_ttf.tlog\SDL_ttf.lastbuildstate".
     8>Done Building Project "C:\compiler\openMSX\build\3rdparty\SDL_ttf.vcxproj" (default targets).
     4>ClCompile:
         C:\Program Files (x86)\Microsoft Visual Studio\2019\Professional\VC\Tools\MSVC\14.24.28314\bin\HostX86\x64\CL.exe /c /I"..\..\derived\3rdParty\src\freetype-2.9.1\include" /nologo /W4 /WX- /diagnostics:column /O2 /Ob2 /Oi /Os /Oy /GT /GL /D NDEBUG /D WIN32 /D _LIB /D FT2_BUILD_LIBRARY /D _CRT_SECURE_NO_WARNINGS /D _VC80_UPGRADE=0x0710 /D _MBCS /GF /Gm- /EHsc /MT /GS /Gy /fp:precise /Za /Zc:wchar_t /Zc:forScope /Zc:inline /Fo"..\..\derived\x64-VC-Release\3rdParty\build\freetype-2.9.1\\" /Fd"..\..\derived\x64-VC-Release\3rdParty\build\freetype-2.9.1\freetype.pdb" /Gd /TC /wd4001 /FC /errorReport:queue "..\..\derived\3rdParty\src\freetype-2.9.1\src\base\ftbase.c" "..\..\derived\3rdParty\src\freetype-2.9.1\src\base\ftglyph.c" "..\..\derived\3rdParty\src\freetype-2.9.1\src\base\ftinit.c" "..\..\derived\3rdParty\src\freetype-2.9.1\src\base\ftmm.c" "..\..\derived\3rdParty\src\freetype-2.9.1\src\base\ftsystem.c" "..\..\derived\3rdParty\src\freetype-2.9.1\src\bdf\bdf.c" "..\..\derived\3rdParty\src\freetype-2.9.1\src\cache\ftcache.c" "..\..\derived\3rdParty\src\freetype-2.9.1\src\cff\cff.c" "..\..\derived\3rdParty\src\freetype-2.9.1\src\cid\type1cid.c" "..\..\derived\3rdParty\src\freetype-2.9.1\src\gzip\ftgzip.c" "..\..\derived\3rdParty\src\freetype-2.9.1\src\lzw\ftlzw.c" "..\..\derived\3rdParty\src\freetype-2.9.1\src\pcf\pcf.c" "..\..\derived\3rdParty\src\freetype-2.9.1\src\pfr\pfr.c" "..\..\derived\3rdParty\src\freetype-2.9.1\src\psaux\psaux.c" "..\..\derived\3rdParty\src\freetype-2.9.1\src\pshinter\pshinter.c" "..\..\derived\3rdParty\src\freetype-2.9.1\src\psnames\psmodule.c" "..\..\derived\3rdParty\src\freetype-2.9.1\src\raster\raster.c" "..\..\derived\3rdParty\src\freetype-2.9.1\src\sfnt\sfnt.c" "..\..\derived\3rdParty\src\freetype-2.9.1\src\smooth\smooth.c" "..\..\derived\3rdParty\src\freetype-2.9.1\src\truetype\truetype.c" "..\..\derived\3rdParty\src\freetype-2.9.1\src\type1\type1.c" "..\..\derived\3rdParty\src\freetype-2.9.1\src\type42\type42.c" "..\..\derived\3rdParty\src\freetype-2.9.1\src\winfonts\winfnt.c"
         ftbase.c
         ftglyph.c
         ftinit.c
         ftmm.c
         ftsystem.c
         bdf.c
         ftcache.c
         cff.c
         type1cid.c
         ftgzip.c
         ftlzw.c
         pcf.c
         pfr.c
         psaux.c
     4>C:\compiler\openMSX\derived\3rdParty\src\freetype-2.9.1\src\psaux\psintrp.c(1002,29): warning C4267: '=': conversion from 'size_t' to 'FT_Fast', possible loss of data [C:\compiler\openMSX\build\3rdparty\freetype.vcxproj]
         pshinter.c
         psmodule.c
         raster.c
         sfnt.c
     4>C:\compiler\openMSX\derived\3rdParty\src\freetype-2.9.1\src\sfnt\sfdriver.c(838,32): warning C4267: '=': conversion from 'size_t' to 'FT_UInt', possible loss of data [C:\compiler\openMSX\build\3rdparty\freetype.vcxproj]
     4>C:\compiler\openMSX\derived\3rdParty\src\freetype-2.9.1\src\sfnt\sfdriver.c(989,44): warning C4244: 'function': conversion from '__int64' to 'const unsigned int', possible loss of data [C:\compiler\openMSX\build\3rdparty\freetype.vcxproj]
         smooth.c
     4>C:\compiler\openMSX\derived\3rdParty\src\freetype-2.9.1\src\smooth\ftgrays.c(1773,26): warning C4267: '+=': conversion from 'size_t' to 'TCoord', possible loss of data [C:\compiler\openMSX\build\3rdparty\freetype.vcxproj]
         truetype.c
     4>C:\compiler\openMSX\derived\3rdParty\src\freetype-2.9.1\src\truetype\ttgload.c(1797,42): warning C4312: 'type cast': conversion from 'unsigned long' to 'void *' of greater size [C:\compiler\openMSX\build\3rdparty\freetype.vcxproj]
         Compiling...
         type1.c
     4>C:\compiler\openMSX\derived\3rdParty\src\freetype-2.9.1\src\type1\t1driver.c(273,49): warning C4267: '=': conversion from 'size_t' to 'FT_ULong', possible loss of data [C:\compiler\openMSX\build\3rdparty\freetype.vcxproj]
     4>C:\compiler\openMSX\derived\3rdParty\src\freetype-2.9.1\src\type1\t1driver.c(293,58): warning C4267: '=': conversion from 'size_t' to 'FT_ULong', possible loss of data [C:\compiler\openMSX\build\3rdparty\freetype.vcxproj]
     4>C:\compiler\openMSX\derived\3rdParty\src\freetype-2.9.1\src\type1\t1driver.c(325,65): warning C4267: '=': conversion from 'size_t' to 'FT_ULong', possible loss of data [C:\compiler\openMSX\build\3rdparty\freetype.vcxproj]
     4>C:\compiler\openMSX\derived\3rdParty\src\freetype-2.9.1\src\type1\t1driver.c(355,23): warning C4267: '=': conversion from 'size_t' to 'FT_UInt', possible loss of data [C:\compiler\openMSX\build\3rdparty\freetype.vcxproj]
     4>C:\compiler\openMSX\derived\3rdParty\src\freetype-2.9.1\src\type1\t1driver.c(562,57): warning C4267: '=': conversion from 'size_t' to 'FT_ULong', possible loss of data [C:\compiler\openMSX\build\3rdparty\freetype.vcxproj]
     4>C:\compiler\openMSX\derived\3rdParty\src\freetype-2.9.1\src\type1\t1driver.c(568,56): warning C4267: '=': conversion from 'size_t' to 'FT_ULong', possible loss of data [C:\compiler\openMSX\build\3rdparty\freetype.vcxproj]
     4>C:\compiler\openMSX\derived\3rdParty\src\freetype-2.9.1\src\type1\t1driver.c(574,59): warning C4267: '=': conversion from 'size_t' to 'FT_ULong', possible loss of data [C:\compiler\openMSX\build\3rdparty\freetype.vcxproj]
     4>C:\compiler\openMSX\derived\3rdParty\src\freetype-2.9.1\src\type1\t1driver.c(580,61): warning C4267: '=': conversion from 'size_t' to 'FT_ULong', possible loss of data [C:\compiler\openMSX\build\3rdparty\freetype.vcxproj]
     4>C:\compiler\openMSX\derived\3rdParty\src\freetype-2.9.1\src\type1\t1driver.c(586,56): warning C4267: '=': conversion from 'size_t' to 'FT_ULong', possible loss of data [C:\compiler\openMSX\build\3rdparty\freetype.vcxproj]
     4>C:\compiler\openMSX\derived\3rdParty\src\freetype-2.9.1\src\type1\t1load.c(1581,68): warning C4244: '=': conversion from '__int64' to 'FT_Int', possible loss of data [C:\compiler\openMSX\build\3rdparty\freetype.vcxproj]
     4>C:\compiler\openMSX\derived\3rdParty\src\freetype-2.9.1\src\type1\t1load.c(1742,40): warning C4244: '=': conversion from '__int64' to 'FT_Int', possible loss of data [C:\compiler\openMSX\build\3rdparty\freetype.vcxproj]
         type42.c
     4>C:\compiler\openMSX\derived\3rdParty\src\freetype-2.9.1\src\type42\t42parse.c(821,66): warning C4244: '=': conversion from '__int64' to 'FT_Int', possible loss of data [C:\compiler\openMSX\build\3rdparty\freetype.vcxproj]
         winfnt.c
         C:\Program Files (x86)\Microsoft Visual Studio\2019\Professional\VC\Tools\MSVC\14.24.28314\bin\HostX86\x64\CL.exe /c /I"..\..\derived\3rdParty\src\freetype-2.9.1\include" /nologo /W4 /WX- /diagnostics:column /O2 /Ob2 /Oi /Os /Oy /GT /GL /D NDEBUG /D WIN32 /D _LIB /D FT2_BUILD_LIBRARY /D _CRT_SECURE_NO_WARNINGS /D _VC80_UPGRADE=0x0710 /D _MBCS /GF /Gm- /EHsc /MT /GS /Gy /fp:precise /Zc:wchar_t /Zc:forScope /Zc:inline /Fo"..\..\derived\x64-VC-Release\3rdParty\build\freetype-2.9.1\\" /Fd"..\..\derived\x64-VC-Release\3rdParty\build\freetype-2.9.1\freetype.pdb" /Gd /TC /wd4001 /FC /errorReport:queue "..\..\derived\3rdParty\src\freetype-2.9.1\builds\windows\ftdebug.c"
         ftdebug.c
       Lib:
         C:\Program Files (x86)\Microsoft Visual Studio\2019\Professional\VC\Tools\MSVC\14.24.28314\bin\HostX86\x64\Lib.exe /OUT:"..\..\derived\x64-VC-Release\3rdParty\install\lib\freetype.lib" /NOLOGO /MACHINE:X64 /LTCG "..\..\derived\x64-VC-Release\3rdParty\build\freetype-2.9.1\autofit.obj"
         "..\..\derived\x64-VC-Release\3rdParty\build\freetype-2.9.1\bdf.obj"
         "..\..\derived\x64-VC-Release\3rdParty\build\freetype-2.9.1\cff.obj"
         "..\..\derived\x64-VC-Release\3rdParty\build\freetype-2.9.1\ftbase.obj"
         "..\..\derived\x64-VC-Release\3rdParty\build\freetype-2.9.1\ftbitmap.obj"
         "..\..\derived\x64-VC-Release\3rdParty\build\freetype-2.9.1\ftcache.obj"
         "..\..\derived\x64-VC-Release\3rdParty\build\freetype-2.9.1\ftdebug.obj"
         "..\..\derived\x64-VC-Release\3rdParty\build\freetype-2.9.1\ftgasp.obj"
         "..\..\derived\x64-VC-Release\3rdParty\build\freetype-2.9.1\ftglyph.obj"
         "..\..\derived\x64-VC-Release\3rdParty\build\freetype-2.9.1\ftgzip.obj"
         "..\..\derived\x64-VC-Release\3rdParty\build\freetype-2.9.1\ftinit.obj"
         "..\..\derived\x64-VC-Release\3rdParty\build\freetype-2.9.1\ftlzw.obj"
         "..\..\derived\x64-VC-Release\3rdParty\build\freetype-2.9.1\ftstroke.obj"
         "..\..\derived\x64-VC-Release\3rdParty\build\freetype-2.9.1\ftsystem.obj"
         "..\..\derived\x64-VC-Release\3rdParty\build\freetype-2.9.1\smooth.obj"
         "..\..\derived\x64-VC-Release\3rdParty\build\freetype-2.9.1\ftbbox.obj"
         "..\..\derived\x64-VC-Release\3rdParty\build\freetype-2.9.1\ftmm.obj"
         "..\..\derived\x64-VC-Release\3rdParty\build\freetype-2.9.1\ftpfr.obj"
         "..\..\derived\x64-VC-Release\3rdParty\build\freetype-2.9.1\ftsynth.obj"
         "..\..\derived\x64-VC-Release\3rdParty\build\freetype-2.9.1\fttype1.obj"
         "..\..\derived\x64-VC-Release\3rdParty\build\freetype-2.9.1\ftwinfnt.obj"
         "..\..\derived\x64-VC-Release\3rdParty\build\freetype-2.9.1\pcf.obj"
         "..\..\derived\x64-VC-Release\3rdParty\build\freetype-2.9.1\pfr.obj"
         "..\..\derived\x64-VC-Release\3rdParty\build\freetype-2.9.1\psaux.obj"
         "..\..\derived\x64-VC-Release\3rdParty\build\freetype-2.9.1\pshinter.obj"
         "..\..\derived\x64-VC-Release\3rdParty\build\freetype-2.9.1\psmodule.obj"
         "..\..\derived\x64-VC-Release\3rdParty\build\freetype-2.9.1\raster.obj"
         "..\..\derived\x64-VC-Release\3rdParty\build\freetype-2.9.1\sfnt.obj"
         "..\..\derived\x64-VC-Release\3rdParty\build\freetype-2.9.1\truetype.obj"
         "..\..\derived\x64-VC-Release\3rdParty\build\freetype-2.9.1\type1.obj"
         "..\..\derived\x64-VC-Release\3rdParty\build\freetype-2.9.1\type1cid.obj"
         "..\..\derived\x64-VC-Release\3rdParty\build\freetype-2.9.1\type42.obj"
         "..\..\derived\x64-VC-Release\3rdParty\build\freetype-2.9.1\winfnt.obj"
         freetype.vcxproj -> C:\compiler\openMSX\build\3rdparty\..\..\derived\x64-VC-Release\3rdParty\install\lib\freetype.lib
       FinalizeBuildStatus:
         Deleting file "..\..\derived\x64-VC-Release\3rdParty\build\freetype-2.9.1\freetype.tlog\unsuccessfulbuild".
         Touching "..\..\derived\x64-VC-Release\3rdParty\build\freetype-2.9.1\freetype.tlog\freetype.lastbuildstate".
     4>Done Building Project "C:\compiler\openMSX\build\3rdparty\freetype.vcxproj" (default targets).
     1>Done Building Project "C:\compiler\openMSX\build\3rdparty\3rdparty.sln" (default targets).

Build succeeded.

       "C:\compiler\openMSX\build\3rdparty\3rdparty.sln" (default target) (1) ->
       "C:\compiler\openMSX\build\3rdparty\SDL_ttf.vcxproj" (default target) (8) ->
       (ClCompile target) -> 
         C:\compiler\openMSX\derived\3rdParty\src\SDL2_ttf-2.0.15\SDL_ttf.c(602,38): warning C4244: '+=': conversion from 'float' to 'int', possible loss of data [C:\compiler\openMSX\build\3rdparty\SDL_ttf.vcxproj]
         C:\compiler\openMSX\derived\3rdParty\src\SDL2_ttf-2.0.15\SDL_ttf.c(603,38): warning C4244: '+=': conversion from 'float' to 'int', possible loss of data [C:\compiler\openMSX\build\3rdparty\SDL_ttf.vcxproj]
         C:\compiler\openMSX\derived\3rdParty\src\SDL2_ttf-2.0.15\SDL_ttf.c(1949,55): warning C4018: '>': signed/unsigned mismatch [C:\compiler\openMSX\build\3rdparty\SDL_ttf.vcxproj]


       "C:\compiler\openMSX\build\3rdparty\3rdparty.sln" (default target) (1) ->
       "C:\compiler\openMSX\build\3rdparty\freetype.vcxproj" (default target) (4) ->
         C:\compiler\openMSX\derived\3rdParty\src\freetype-2.9.1\src\psaux\psintrp.c(1002,29): warning C4267: '=': conversion from 'size_t' to 'FT_Fast', possible loss of data [C:\compiler\openMSX\build\3rdparty\freetype.vcxproj]
         C:\compiler\openMSX\derived\3rdParty\src\freetype-2.9.1\src\sfnt\sfdriver.c(838,32): warning C4267: '=': conversion from 'size_t' to 'FT_UInt', possible loss of data [C:\compiler\openMSX\build\3rdparty\freetype.vcxproj]
         C:\compiler\openMSX\derived\3rdParty\src\freetype-2.9.1\src\sfnt\sfdriver.c(989,44): warning C4244: 'function': conversion from '__int64' to 'const unsigned int', possible loss of data [C:\compiler\openMSX\build\3rdparty\freetype.vcxproj]
         C:\compiler\openMSX\derived\3rdParty\src\freetype-2.9.1\src\smooth\ftgrays.c(1773,26): warning C4267: '+=': conversion from 'size_t' to 'TCoord', possible loss of data [C:\compiler\openMSX\build\3rdparty\freetype.vcxproj]
         C:\compiler\openMSX\derived\3rdParty\src\freetype-2.9.1\src\truetype\ttgload.c(1797,42): warning C4312: 'type cast': conversion from 'unsigned long' to 'void *' of greater size [C:\compiler\openMSX\build\3rdparty\freetype.vcxproj]
         C:\compiler\openMSX\derived\3rdParty\src\freetype-2.9.1\src\type1\t1driver.c(273,49): warning C4267: '=': conversion from 'size_t' to 'FT_ULong', possible loss of data [C:\compiler\openMSX\build\3rdparty\freetype.vcxproj]
         C:\compiler\openMSX\derived\3rdParty\src\freetype-2.9.1\src\type1\t1driver.c(293,58): warning C4267: '=': conversion from 'size_t' to 'FT_ULong', possible loss of data [C:\compiler\openMSX\build\3rdparty\freetype.vcxproj]
         C:\compiler\openMSX\derived\3rdParty\src\freetype-2.9.1\src\type1\t1driver.c(325,65): warning C4267: '=': conversion from 'size_t' to 'FT_ULong', possible loss of data [C:\compiler\openMSX\build\3rdparty\freetype.vcxproj]
         C:\compiler\openMSX\derived\3rdParty\src\freetype-2.9.1\src\type1\t1driver.c(355,23): warning C4267: '=': conversion from 'size_t' to 'FT_UInt', possible loss of data [C:\compiler\openMSX\build\3rdparty\freetype.vcxproj]
         C:\compiler\openMSX\derived\3rdParty\src\freetype-2.9.1\src\type1\t1driver.c(562,57): warning C4267: '=': conversion from 'size_t' to 'FT_ULong', possible loss of data [C:\compiler\openMSX\build\3rdparty\freetype.vcxproj]
         C:\compiler\openMSX\derived\3rdParty\src\freetype-2.9.1\src\type1\t1driver.c(568,56): warning C4267: '=': conversion from 'size_t' to 'FT_ULong', possible loss of data [C:\compiler\openMSX\build\3rdparty\freetype.vcxproj]
         C:\compiler\openMSX\derived\3rdParty\src\freetype-2.9.1\src\type1\t1driver.c(574,59): warning C4267: '=': conversion from 'size_t' to 'FT_ULong', possible loss of data [C:\compiler\openMSX\build\3rdparty\freetype.vcxproj]
         C:\compiler\openMSX\derived\3rdParty\src\freetype-2.9.1\src\type1\t1driver.c(580,61): warning C4267: '=': conversion from 'size_t' to 'FT_ULong', possible loss of data [C:\compiler\openMSX\build\3rdparty\freetype.vcxproj]
         C:\compiler\openMSX\derived\3rdParty\src\freetype-2.9.1\src\type1\t1driver.c(586,56): warning C4267: '=': conversion from 'size_t' to 'FT_ULong', possible loss of data [C:\compiler\openMSX\build\3rdparty\freetype.vcxproj]
         C:\compiler\openMSX\derived\3rdParty\src\freetype-2.9.1\src\type1\t1load.c(1581,68): warning C4244: '=': conversion from '__int64' to 'FT_Int', possible loss of data [C:\compiler\openMSX\build\3rdparty\freetype.vcxproj]
         C:\compiler\openMSX\derived\3rdParty\src\freetype-2.9.1\src\type1\t1load.c(1742,40): warning C4244: '=': conversion from '__int64' to 'FT_Int', possible loss of data [C:\compiler\openMSX\build\3rdparty\freetype.vcxproj]
         C:\compiler\openMSX\derived\3rdParty\src\freetype-2.9.1\src\type42\t42parse.c(821,66): warning C4244: '=': conversion from '__int64' to 'FT_Int', possible loss of data [C:\compiler\openMSX\build\3rdparty\freetype.vcxproj]

    20 Warning(s)
    0 Error(s)

Time Elapsed 00:00:06.51
Back To Top

64 bit compile

Microsoft (R) Build Engine version 16.4.0+e901037fe for .NET Framework
Copyright (C) Microsoft Corporation. All rights reserved.

Build started 3/29/2020 10:50:31 AM.
     1>Project "C:\compiler\openMSX\build\msvc\openmsx.sln" on node 1 (default targets).
     1>ValidateSolutionConfiguration:
         Building solution configuration "Release|x64".
     1>Project "C:\compiler\openMSX\build\msvc\openmsx.sln" (1) is building "C:\compiler\openMSX\build\msvc\openmsx.vcxproj" (2) on node 1 (default targets).
     2>InitializeBuildStatus:
         Creating "..\..\derived\x64-VC-Release\build\openmsx.tlog\unsuccessfulbuild" because "AlwaysCreate" was specified.
       CustomBuild:
         Generating config headers...
         Up to date: C:\compiler\openMSX\derived\x64-VC-Release\config\build-info.hh
         Up to date: C:\compiler\openMSX\derived\x64-VC-Release\config\components.hh
         Up to date: C:\compiler\openMSX\derived\x64-VC-Release\config\systemfuncs.hh
         Updating C:\compiler\openMSX\derived\x64-VC-Release\config\resource-info.h...
         Updating C:\compiler\openMSX\derived\x64-VC-Release\config\version.ii...
     2>C:\Program Files (x86)\Microsoft Visual Studio\2019\Professional\MSBuild\Microsoft\VC\v160\Microsoft.CppCommon.targets(231,5): warning MSB8065: Custom build for item "..\..\src\openmsx.hh" succeeded, but specified output "c:\compiler\openmsx\build\msvc\build-info.hh" has not been created. This may cause incremental build to work incorrectly. [C:\compiler\openMSX\build\msvc\openmsx.vcxproj]
     2>C:\Program Files (x86)\Microsoft Visual Studio\2019\Professional\MSBuild\Microsoft\VC\v160\Microsoft.CppCommon.targets(231,5): warning MSB8065: Custom build for item "..\..\src\openmsx.hh" succeeded, but specified output "c:\compiler\openmsx\build\msvc\components.hh" has not been created. This may cause incremental build to work incorrectly. [C:\compiler\openMSX\build\msvc\openmsx.vcxproj]
     2>C:\Program Files (x86)\Microsoft Visual Studio\2019\Professional\MSBuild\Microsoft\VC\v160\Microsoft.CppCommon.targets(231,5): warning MSB8065: Custom build for item "..\..\src\openmsx.hh" succeeded, but specified output "c:\compiler\openmsx\build\msvc\probed_defs.hh" has not been created. This may cause incremental build to work incorrectly. [C:\compiler\openMSX\build\msvc\openmsx.vcxproj]
     2>C:\Program Files (x86)\Microsoft Visual Studio\2019\Professional\MSBuild\Microsoft\VC\v160\Microsoft.CppCommon.targets(231,5): warning MSB8065: Custom build for item "..\..\src\openmsx.hh" succeeded, but specified output "c:\compiler\openmsx\build\msvc\resource-info.h" has not been created. This may cause incremental build to work incorrectly. [C:\compiler\openMSX\build\msvc\openmsx.vcxproj]
     2>C:\Program Files (x86)\Microsoft Visual Studio\2019\Professional\MSBuild\Microsoft\VC\v160\Microsoft.CppCommon.targets(231,5): warning MSB8065: Custom build for item "..\..\src\openmsx.hh" succeeded, but specified output "c:\compiler\openmsx\build\msvc\version.ii" has not been created. This may cause incremental build to work incorrectly. [C:\compiler\openMSX\build\msvc\openmsx.vcxproj]
       ClCompile:
         C:\Program Files (x86)\Microsoft Visual Studio\2019\Professional\VC\Tools\MSVC\14.24.28314\bin\HostX64\x64\CL.exe /c /I"..\..\derived\x64-VC-Release\config" /I\Include /I"..\..\derived\3rdParty\src\freetype-2.9.1" /I"..\..\derived\3rdParty\src\glew-2.1.0\include" /I"..\..\derived\3rdParty\src\libpng-1.6.36" /I"..\..\derived\3rdParty\src\SDL2-2.0.10\include" /I"..\..\derived\3rdParty\src\SDL2_ttf-2.0.15" /I"..\..\derived\3rdParty\src\libtheora-1.1.1\include" /I"..\..\derived\3rdParty\src\libvorbis-1.3.6\include" /I"..\..\derived\3rdParty\src\libogg-1.3.3\include" /I..\..\derived\3rdParty\src\tcl8.6.9\generic /I"..\..\derived\3rdParty\src\zlib-1.2.11" /I..\..\src /I..\..\src\cassette /I..\..\src\commands /I..\..\src\config /I..\..\src\console /I..\..\src\cpu /I..\..\src\debugger /I..\..\src\events /I..\..\src\fdc /I..\..\src\file /I..\..\src\ide /I..\..\src\input /I..\..\src\laserdisc /I..\..\src\memory /I..\..\src\resource /I..\..\src\security /I..\..\src\serial /I..\..\src\settings /I..\..\src\sound /I..\..\src\thread /I..\..\src\utils /I..\..\src\video /I..\..\src\video\scalers /I..\..\src\video\ld /I..\..\src\video\v9990 /Zi /nologo /W4 /WX- /diagnostics:column /Ox /Ob2 /Oi /Os /Oy /GT /GL /D __SSE__ /D __SSE2__ /D WIN32 /D _WIN64 /D __x86_64 /D WIN32_LEAN_AND_MEAN /D UNICODE /D _UNICODE /D SECURITY_WIN32 /D NDEBUG /D _CONSOLE /D _USE_MATH_DEFINES /D _CRT_SECURE_NO_WARNINGS /D _CRT_NONSTDC_NO_DEPRECATE /D NOMINMAX /D GLEW_STATIC /D STATIC_BUILD /D _UNICODE /D UNICODE /GF /Gm- /EHsc /MT /GS /Gy /fp:precise /Zc:wchar_t /Zc:forScope /Zc:inline /std:c++17 /Fo"..\..\derived\x64-VC-Release\build\\" /Fd"..\..\derived\x64-VC-Release\build\vc142.pdb" /Gd /TP /wd4324 /wd4063 /wd4121 /wd4125 /wd4127 /wd4189 /wd4201 /wd4244 /wd4310 /wd4355 /wd4505 /wd4512 /wd4611 /wd4702 /FC /errorReport:queue /constexpr:steps20000000 /MP ..\..\src\cassette\CassettePlayer.cc ..\..\src\cassette\CassettePort.cc ..\..\src\events\InputEventGenerator.cc ..\..\src\fdc\RealDrive.cc ..\..\src\ide\HD.cc ..\..\src\ide\BeerIDE.cc ..\..\src\input\Joystick.cc ..\..\src\memory\Carnivore2.cc ..\..\src\memory\CheckedRam.cc ..\..\src\memory\ColecoSuperGameModule.cc ..\..\src\memory\ESE_SCC.cc ..\..\src\memory\MSXHBI55.cc ..\..\src\memory\MusicalMemoryMapper.cc ..\..\src\memory\RomFactory.cc ..\..\src\memory\RomKonamiKeyboardMaster.cc ..\..\src\memory\RomKonamiSCC.cc ..\..\src\memory\RomMajutsushi.cc ..\..\src\memory\RomManbow2.cc ..\..\src\memory\RomNettouYakyuu.cc ..\..\src\memory\RomPlayBall.cc ..\..\src\memory\RomSynthesizer.cc ..\..\src\memory\ReproCartridgeV1.cc ..\..\src\memory\ReproCartridgeV2.cc ..\..\src\memory\KonamiUltimateCollection.cc ..\..\src\memory\MegaFlashRomSCCPlus.cc ..\..\src\memory\MegaFlashRomSCCPlusSD.cc ..\..\src\sound\AY8910.cc ..\..\src\sound\DACSound16S.cc ..\..\src\sound\DACSound8U.cc ..\..\src\sound\KeyClick.cc ..\..\src\sound\MSXAudio.cc ..\..\src\sound\MSXFmPac.cc ..\..\src\sound\MSXMixer.cc ..\..\src\sound\MSXMoonSound.cc ..\..\src\sound\MSXMusic.cc ..\..\src\sound\MSXOPL3Cartridge.cc ..\..\src\sound\MSXPSG.cc ..\..\src\sound\MSXSCCPlusCart.cc ..\..\src\sound\MSXTurboRPCM.cc ..\..\src\sound\MSXYamahaSFG.cc ..\..\src\sound\ResampledSoundDevice.cc ..\..\src\sound\ResampleBlip.cc ..\..\src\sound\ResampleHQ.cc ..\..\src\sound\ResampleLQ.cc ..\..\src\sound\ResampleTrivial.cc ..\..\src\sound\SamplePlayer.cc ..\..\src\sound\SCC.cc ..\..\src\sound\SDLSoundDriver.cc ..\..\src\sound\SN76489.cc ..\..\src\sound\SNPSG.cc ..\..\src\sound\SoundDevice.cc ..\..\src\sound\VLM5030.cc ..\..\src\sound\Y8950.cc ..\..\src\sound\Y8950Adpcm.cc ..\..\src\sound\Y8950Periphery.cc ..\..\src\sound\YM2151.cc ..\..\src\sound\YM2413.cc ..\..\src\sound\YM2413Burczynski.cc ..\..\src\sound\YM2413Okazaki.cc ..\..\src\sound\YM2413NukeYKT.cc ..\..\src\sound\YM2413OriginalNukeYKT.cc ..\..\src\sound\opll.cc.cc ..\..\src\sound\YMF262.cc ..\..\src\sound\YMF278.cc ..\..\src\video\SDLVideoSystem.cc ..\..\src\video\VideoLayer.cc ..\..\src\video\ld\LDPixelRenderer.cc ..\..\src\laserdisc\LaserdiscPlayer.cc ..\..\src\laserdisc\PioneerLDControl.cc ..\..\src\DeviceFactory.cc ..\..\src\GlobalSettings.cc ..\..\src\MSXMotherBoard.cc ..\..\src\MSXPPI.cc ..\..\src\PrinterPortSimpl.cc ..\..\src\Reactor.cc ..\..\src\RealTime.cc ..\..\src\Version.cc ..\..\src\sound\SVIPSG.cc ..\..\src\SVIPPI.cc
         CassettePlayer.cc
         CassettePort.cc
         InputEventGenerator.cc
         RealDrive.cc
         HD.cc
         BeerIDE.cc
         Joystick.cc
         Carnivore2.cc
         CheckedRam.cc
         ColecoSuperGameModule.cc
         ESE_SCC.cc
         MSXHBI55.cc
         MusicalMemoryMapper.cc
         RomFactory.cc
         RomKonamiKeyboardMaster.cc
         RomKonamiSCC.cc
         RomMajutsushi.cc
         RomManbow2.cc
         RomNettouYakyuu.cc
         RomPlayBall.cc
         RomSynthesizer.cc
         ReproCartridgeV1.cc
         ReproCartridgeV2.cc
         KonamiUltimateCollection.cc
         MegaFlashRomSCCPlus.cc
         MegaFlashRomSCCPlusSD.cc
         AY8910.cc
         DACSound16S.cc
         DACSound8U.cc
         KeyClick.cc
         MSXAudio.cc
         MSXFmPac.cc
         MSXMixer.cc
         MSXMoonSound.cc
         MSXMusic.cc
         MSXOPL3Cartridge.cc
         MSXPSG.cc
         MSXSCCPlusCart.cc
         MSXTurboRPCM.cc
         MSXYamahaSFG.cc
         ResampledSoundDevice.cc
         ResampleBlip.cc
         ResampleHQ.cc
         ResampleLQ.cc
         ResampleTrivial.cc
         SamplePlayer.cc
     2>C:\compiler\openMSX\src\sound\ResampleHQ.cc(43,44): warning C4267: 'initializing': conversion from 'size_t' to 'const int', possible loss of data [C:\compiler\openMSX\build\msvc\openmsx.vcxproj]
         SCC.cc
         SDLSoundDriver.cc
         SN76489.cc
         SNPSG.cc
         SoundDevice.cc
         VLM5030.cc
         Y8950.cc
         Y8950Adpcm.cc
         Y8950Periphery.cc
         YM2151.cc
         YM2413.cc
         YM2413Burczynski.cc
         YM2413Okazaki.cc
         YM2413NukeYKT.cc
     2>C:\compiler\openMSX\src\sound\YM2413NukeYKT.cc(327,1): warning C4805: '|=': unsafe mix of type 'bool' and type 'int' in operation [C:\compiler\openMSX\build\msvc\openmsx.vcxproj]
       C:\compiler\openMSX\src\sound\YM2413NukeYKT.cc(786): message : see reference to function template instantiation 'void openmsx::YM2413NukeYKT::YM2413::envelopeGenerate2<0>(const openmsx::YM2413NukeYKT::YM2413::Patch &,bool)' being compiled [C:\compiler\openMSX\build\msvc\openmsx.vcxproj]
       C:\compiler\openMSX\src\sound\YM2413NukeYKT.cc(838): message : see reference to function template instantiation 'void openmsx::YM2413NukeYKT::YM2413::step<0,true>(openmsx::YM2413NukeYKT::YM2413::Locals &)' being compiled [C:\compiler\openMSX\build\msvc\openmsx.vcxproj]
       C:\compiler\openMSX\src\sound\YM2413NukeYKT.cc(820): message : see reference to function template instantiation 'void openmsx::YM2413NukeYKT::YM2413::step18(float *[])' being compiled [C:\compiler\openMSX\build\msvc\openmsx.vcxproj]
       C:\compiler\openMSX\src\sound\YM2413NukeYKT.hh(138): message : see reference to class template instantiation 'std::array' being compiled (compiling source file ..\..\src\sound\YM2413NukeYKT.cc) [C:\compiler\openMSX\build\msvc\openmsx.vcxproj]
     2>C:\compiler\openMSX\src\sound\YM2413NukeYKT.cc(327,1): warning C4805: '|': unsafe mix of type 'bool' and type 'int' in operation [C:\compiler\openMSX\build\msvc\openmsx.vcxproj]
     2>C:\compiler\openMSX\src\sound\YM2413NukeYKT.cc(330,1): warning C4805: '|=': unsafe mix of type 'bool' and type 'int' in operation [C:\compiler\openMSX\build\msvc\openmsx.vcxproj]
     2>C:\compiler\openMSX\src\sound\YM2413NukeYKT.cc(330,1): warning C4805: '|': unsafe mix of type 'bool' and type 'int' in operation [C:\compiler\openMSX\build\msvc\openmsx.vcxproj]
     2>C:\compiler\openMSX\src\sound\YM2413NukeYKT.cc(333,1): warning C4805: '|=': unsafe mix of type 'bool' and type 'int' in operation [C:\compiler\openMSX\build\msvc\openmsx.vcxproj]
     2>C:\compiler\openMSX\src\sound\YM2413NukeYKT.cc(333,1): warning C4805: '|': unsafe mix of type 'bool' and type 'int' in operation [C:\compiler\openMSX\build\msvc\openmsx.vcxproj]
     2>C:\compiler\openMSX\src\sound\YM2413NukeYKT.cc(336,1): warning C4805: '|=': unsafe mix of type 'bool' and type 'int' in operation [C:\compiler\openMSX\build\msvc\openmsx.vcxproj]
     2>C:\compiler\openMSX\src\sound\YM2413NukeYKT.cc(336,1): warning C4805: '|': unsafe mix of type 'bool' and type 'int' in operation [C:\compiler\openMSX\build\msvc\openmsx.vcxproj]
     2>C:\compiler\openMSX\src\sound\YM2413NukeYKT.cc(454,1): warning C4805: '|=': unsafe mix of type 'bool' and type 'int' in operation [C:\compiler\openMSX\build\msvc\openmsx.vcxproj]
       C:\compiler\openMSX\src\sound\YM2413NukeYKT.cc(790): message : see reference to function template instantiation 'void openmsx::YM2413NukeYKT::YM2413::doRhythm<0,true>(void)' being compiled [C:\compiler\openMSX\build\msvc\openmsx.vcxproj]
     2>C:\compiler\openMSX\src\sound\YM2413NukeYKT.cc(454,1): warning C4805: '|': unsafe mix of type 'bool' and type 'int' in operation [C:\compiler\openMSX\build\msvc\openmsx.vcxproj]
         YM2413OriginalNukeYKT.cc
         opll.cc.cc
     2>c1xx : fatal error C1083: Cannot open source file: '..\..\src\sound\opll.cc.cc': No such file or directory [C:\compiler\openMSX\build\msvc\openmsx.vcxproj]
         YMF262.cc
         YMF278.cc
         SDLVideoSystem.cc
         VideoLayer.cc
         LDPixelRenderer.cc
         LaserdiscPlayer.cc
         PioneerLDControl.cc
         DeviceFactory.cc
         GlobalSettings.cc
         MSXMotherBoard.cc
         MSXPPI.cc
         PrinterPortSimpl.cc
         Reactor.cc
         RealTime.cc
         Version.cc
         SVIPSG.cc
         SVIPPI.cc
     2>Done Building Project "C:\compiler\openMSX\build\msvc\openmsx.vcxproj" (default targets) -- FAILED.
     1>Done Building Project "C:\compiler\openMSX\build\msvc\openmsx.sln" (default targets) -- FAILED.

Build FAILED.

       "C:\compiler\openMSX\build\msvc\openmsx.sln" (default target) (1) ->
       "C:\compiler\openMSX\build\msvc\openmsx.vcxproj" (default target) (2) ->
       (CustomBuild target) -> 
         C:\Program Files (x86)\Microsoft Visual Studio\2019\Professional\MSBuild\Microsoft\VC\v160\Microsoft.CppCommon.targets(231,5): warning MSB8065: Custom build for item "..\..\src\openmsx.hh" succeeded, but specified output "c:\compiler\openmsx\build\msvc\build-info.hh" has not been created. This may cause incremental build to work incorrectly. [C:\compiler\openMSX\build\msvc\openmsx.vcxproj]
         C:\Program Files (x86)\Microsoft Visual Studio\2019\Professional\MSBuild\Microsoft\VC\v160\Microsoft.CppCommon.targets(231,5): warning MSB8065: Custom build for item "..\..\src\openmsx.hh" succeeded, but specified output "c:\compiler\openmsx\build\msvc\components.hh" has not been created. This may cause incremental build to work incorrectly. [C:\compiler\openMSX\build\msvc\openmsx.vcxproj]
         C:\Program Files (x86)\Microsoft Visual Studio\2019\Professional\MSBuild\Microsoft\VC\v160\Microsoft.CppCommon.targets(231,5): warning MSB8065: Custom build for item "..\..\src\openmsx.hh" succeeded, but specified output "c:\compiler\openmsx\build\msvc\probed_defs.hh" has not been created. This may cause incremental build to work incorrectly. [C:\compiler\openMSX\build\msvc\openmsx.vcxproj]
         C:\Program Files (x86)\Microsoft Visual Studio\2019\Professional\MSBuild\Microsoft\VC\v160\Microsoft.CppCommon.targets(231,5): warning MSB8065: Custom build for item "..\..\src\openmsx.hh" succeeded, but specified output "c:\compiler\openmsx\build\msvc\resource-info.h" has not been created. This may cause incremental build to work incorrectly. [C:\compiler\openMSX\build\msvc\openmsx.vcxproj]
         C:\Program Files (x86)\Microsoft Visual Studio\2019\Professional\MSBuild\Microsoft\VC\v160\Microsoft.CppCommon.targets(231,5): warning MSB8065: Custom build for item "..\..\src\openmsx.hh" succeeded, but specified output "c:\compiler\openmsx\build\msvc\version.ii" has not been created. This may cause incremental build to work incorrectly. [C:\compiler\openMSX\build\msvc\openmsx.vcxproj]


       "C:\compiler\openMSX\build\msvc\openmsx.sln" (default target) (1) ->
       "C:\compiler\openMSX\build\msvc\openmsx.vcxproj" (default target) (2) ->
       (ClCompile target) -> 
         C:\compiler\openMSX\src\sound\ResampleHQ.cc(43,44): warning C4267: 'initializing': conversion from 'size_t' to 'const int', possible loss of data [C:\compiler\openMSX\build\msvc\openmsx.vcxproj]
         C:\compiler\openMSX\src\sound\YM2413NukeYKT.cc(327,1): warning C4805: '|=': unsafe mix of type 'bool' and type 'int' in operation [C:\compiler\openMSX\build\msvc\openmsx.vcxproj]
         C:\compiler\openMSX\src\sound\YM2413NukeYKT.cc(327,1): warning C4805: '|': unsafe mix of type 'bool' and type 'int' in operation [C:\compiler\openMSX\build\msvc\openmsx.vcxproj]
         C:\compiler\openMSX\src\sound\YM2413NukeYKT.cc(330,1): warning C4805: '|=': unsafe mix of type 'bool' and type 'int' in operation [C:\compiler\openMSX\build\msvc\openmsx.vcxproj]
         C:\compiler\openMSX\src\sound\YM2413NukeYKT.cc(330,1): warning C4805: '|': unsafe mix of type 'bool' and type 'int' in operation [C:\compiler\openMSX\build\msvc\openmsx.vcxproj]
         C:\compiler\openMSX\src\sound\YM2413NukeYKT.cc(333,1): warning C4805: '|=': unsafe mix of type 'bool' and type 'int' in operation [C:\compiler\openMSX\build\msvc\openmsx.vcxproj]
         C:\compiler\openMSX\src\sound\YM2413NukeYKT.cc(333,1): warning C4805: '|': unsafe mix of type 'bool' and type 'int' in operation [C:\compiler\openMSX\build\msvc\openmsx.vcxproj]
         C:\compiler\openMSX\src\sound\YM2413NukeYKT.cc(336,1): warning C4805: '|=': unsafe mix of type 'bool' and type 'int' in operation [C:\compiler\openMSX\build\msvc\openmsx.vcxproj]
         C:\compiler\openMSX\src\sound\YM2413NukeYKT.cc(336,1): warning C4805: '|': unsafe mix of type 'bool' and type 'int' in operation [C:\compiler\openMSX\build\msvc\openmsx.vcxproj]
         C:\compiler\openMSX\src\sound\YM2413NukeYKT.cc(454,1): warning C4805: '|=': unsafe mix of type 'bool' and type 'int' in operation [C:\compiler\openMSX\build\msvc\openmsx.vcxproj]
         C:\compiler\openMSX\src\sound\YM2413NukeYKT.cc(454,1): warning C4805: '|': unsafe mix of type 'bool' and type 'int' in operation [C:\compiler\openMSX\build\msvc\openmsx.vcxproj]


       "C:\compiler\openMSX\build\msvc\openmsx.sln" (default target) (1) ->
       "C:\compiler\openMSX\build\msvc\openmsx.vcxproj" (default target) (2) ->
       (ClCompile target) -> 
         c1xx : fatal error C1083: Cannot open source file: '..\..\src\sound\opll.cc.cc': No such file or directory [C:\compiler\openMSX\build\msvc\openmsx.vcxproj]

    16 Warning(s)
    1 Error(s)

Time Elapsed 00:01:02.28
Back To Top
**********************************************************************
** Visual Studio 2019 Developer Command Prompt v16.4.5
** Copyright (c) 2019 Microsoft Corporation
**********************************************************************
[vcvarsall.bat] Environment initialized for: 'x86'

32 bit 3rd party

Microsoft (R) Build Engine version 16.4.0+e901037fe for .NET Framework
Copyright (C) Microsoft Corporation. All rights reserved.

Build started 3/29/2020 10:51:35 AM.
     1>Project "C:\compiler\openMSX\build\3rdparty\3rdparty.sln" on node 1 (default targets).
     1>ValidateSolutionConfiguration:
         Building solution configuration "Release|Win32".
     1>Project "C:\compiler\openMSX\build\3rdparty\3rdparty.sln" (1) is building "C:\compiler\openMSX\build\3rdparty\glew.vcxproj" (2) on node 1 (default targets).
     2>InitializeBuildStatus:
         Creating "..\..\derived\Win32-VC-Release\3rdParty\build\glew-2.1.0\glew.tlog\unsuccessfulbuild" because "AlwaysCreate" was specified.
       ClCompile:
         All outputs are up-to-date.
       ResourceCompile:
         All outputs are up-to-date.
       Lib:
         All outputs are up-to-date.
         glew.vcxproj -> C:\compiler\openMSX\build\3rdparty\..\..\derived\Win32-VC-Release\3rdParty\install\lib\glew.lib
       FinalizeBuildStatus:
         Deleting file "..\..\derived\Win32-VC-Release\3rdParty\build\glew-2.1.0\glew.tlog\unsuccessfulbuild".
         Touching "..\..\derived\Win32-VC-Release\3rdParty\build\glew-2.1.0\glew.tlog\glew.lastbuildstate".
     2>Done Building Project "C:\compiler\openMSX\build\3rdparty\glew.vcxproj" (default targets).
     1>Project "C:\compiler\openMSX\build\3rdparty\3rdparty.sln" (1) is building "C:\compiler\openMSX\build\3rdparty\libtheora.vcxproj" (3) on node 1 (default targets).
     3>InitializeBuildStatus:
         Creating "..\..\derived\Win32-VC-Release\3rdParty\build\libtheora-1.1.1\libtheora.tlog\unsuccessfulbuild" because "AlwaysCreate" was specified.
       ClCompile:
         All outputs are up-to-date.
         All outputs are up-to-date.
         All outputs are up-to-date.
         All outputs are up-to-date.
       Lib:
         All outputs are up-to-date.
         libtheora.vcxproj -> C:\compiler\openMSX\build\3rdparty\..\..\derived\Win32-VC-Release\3rdParty\install\lib\libtheora.lib
       FinalizeBuildStatus:
         Deleting file "..\..\derived\Win32-VC-Release\3rdParty\build\libtheora-1.1.1\libtheora.tlog\unsuccessfulbuild".
         Touching "..\..\derived\Win32-VC-Release\3rdParty\build\libtheora-1.1.1\libtheora.tlog\libtheora.lastbuildstate".
     3>Done Building Project "C:\compiler\openMSX\build\3rdparty\libtheora.vcxproj" (default targets).
     1>Project "C:\compiler\openMSX\build\3rdparty\3rdparty.sln" (1) is building "C:\compiler\openMSX\build\3rdparty\libvorbis.vcxproj" (6) on node 1 (default targets).
     6>InitializeBuildStatus:
         Creating "..\..\derived\Win32-VC-Release\3rdParty\build\libvorbis-1.3.6\libvorbis.tlog\unsuccessfulbuild" because "AlwaysCreate" was specified.
       ClCompile:
         All outputs are up-to-date.
       Lib:
         All outputs are up-to-date.
         libvorbis.vcxproj -> C:\compiler\openMSX\build\3rdparty\..\..\derived\Win32-VC-Release\3rdParty\install\lib\libvorbis.lib
       FinalizeBuildStatus:
         Deleting file "..\..\derived\Win32-VC-Release\3rdParty\build\libvorbis-1.3.6\libvorbis.tlog\unsuccessfulbuild".
         Touching "..\..\derived\Win32-VC-Release\3rdParty\build\libvorbis-1.3.6\libvorbis.tlog\libvorbis.lastbuildstate".
     6>Done Building Project "C:\compiler\openMSX\build\3rdparty\libvorbis.vcxproj" (default targets).
     1>Project "C:\compiler\openMSX\build\3rdparty\3rdparty.sln" (1) is building "C:\compiler\openMSX\build\3rdparty\SDL.vcxproj" (8) on node 1 (default targets).
     8>InitializeBuildStatus:
         Creating "..\..\derived\Win32-VC-Release\3rdParty\build\SDL2-2.0.10\SDL.tlog\unsuccessfulbuild" because "AlwaysCreate" was specified.
     1>Project "C:\compiler\openMSX\build\3rdparty\3rdparty.sln" (1) is building "C:\compiler\openMSX\build\3rdparty\libogg.vcxproj" (4) on node 3 (default targets).
     4>InitializeBuildStatus:
         Creating "..\..\derived\Win32-VC-Release\3rdParty\build\libogg-1.3.3\libogg.tlog\unsuccessfulbuild" because "AlwaysCreate" was specified.
     1>Project "C:\compiler\openMSX\build\3rdparty\3rdparty.sln" (1) is building "C:\compiler\openMSX\build\3rdparty\freetype.vcxproj" (5) on node 2 (default targets).
     5>InitializeBuildStatus:
         Creating "..\..\derived\Win32-VC-Release\3rdParty\build\freetype-2.9.1\freetype.tlog\unsuccessfulbuild" because "AlwaysCreate" was specified.
       ClCompile:
         C:\Program Files (x86)\Microsoft Visual Studio\2019\Professional\VC\Tools\MSVC\14.24.28314\bin\HostX86\x86\CL.exe /c /I"..\..\derived\3rdParty\src\freetype-2.9.1\include" /nologo /W4 /WX- /diagnostics:column /Ox /Ob2 /Oi /Os /Oy /GT /GL /D NDEBUG /D WIN32 /D _LIB /D FT2_BUILD_LIBRARY /D _CRT_SECURE_NO_WARNINGS /D _VC80_UPGRADE=0x0710 /D _MBCS /GF /Gm- /EHsc /MT /GS /Gy /fp:precise /Za /Zc:wchar_t /Zc:forScope /Zc:inline /Fo"..\..\derived\Win32-VC-Release\3rdParty\build\freetype-2.9.1\\" /Fd"..\..\derived\Win32-VC-Release\3rdParty\build\freetype-2.9.1\freetype.pdb" /Gd /TC /wd4001 /analyze- /FC /errorReport:queue "..\..\derived\3rdParty\src\freetype-2.9.1\src\autofit\autofit.c" "..\..\derived\3rdParty\src\freetype-2.9.1\src\base\ftbbox.c" "..\..\derived\3rdParty\src\freetype-2.9.1\src\base\ftbitmap.c" "..\..\derived\3rdParty\src\freetype-2.9.1\src\base\ftgasp.c" "..\..\derived\3rdParty\src\freetype-2.9.1\src\base\ftpfr.c" "..\..\derived\3rdParty\src\freetype-2.9.1\src\base\ftstroke.c" "..\..\derived\3rdParty\src\freetype-2.9.1\src\base\ftsynth.c" "..\..\derived\3rdParty\src\freetype-2.9.1\src\base\fttype1.c" "..\..\derived\3rdParty\src\freetype-2.9.1\src\base\ftwinfnt.c"
     1>Project "C:\compiler\openMSX\build\3rdparty\3rdparty.sln" (1) is building "C:\compiler\openMSX\build\3rdparty\libpng.vcxproj" (7) on node 4 (default targets).
     7>InitializeBuildStatus:
         Creating "..\..\derived\Win32-VC-Release\3rdParty\build\libpng-1.6.36\libpng.tlog\unsuccessfulbuild" because "AlwaysCreate" was specified.
       PreBuildEvent:
         copy ..\..\derived\3rdParty\src\libpng-1.6.36\scripts\pnglibconf.h.prebuilt ..\..\derived\3rdParty\src\libpng-1.6.36\pnglibconf.h
         :VCEnd
     1>Project "C:\compiler\openMSX\build\3rdparty\3rdparty.sln" (1) is building "C:\compiler\openMSX\build\3rdparty\SDL_ttf.vcxproj" (9) on node 2 (default targets).
     9>InitializeBuildStatus:
         Creating "..\..\derived\Win32-VC-Release\3rdParty\build\SDL2_ttf-2.0.15\SDL_ttf.tlog\unsuccessfulbuild" because "AlwaysCreate" was specified.
     4>ClCompile:
         All outputs are up-to-date.
     9>ClCompile:
         C:\Program Files (x86)\Microsoft Visual Studio\2019\Professional\VC\Tools\MSVC\14.24.28314\bin\HostX86\x86\CL.exe /c /I"..\..\derived\3rdParty\src\SDL2-2.0.10\include" /I"..\..\derived\3rdParty\src\freetype-2.9.1\include" /Zi /nologo /W3 /WX- /diagnostics:column /Ox /Ob2 /Oi /Os /Oy /GT /GL /D WIN32 /D NDEBUG /D _WINDOWS /D _VC80_UPGRADE=0x0600 /GF /Gm- /EHsc /MT /GS /Gy /fp:precise /Zc:wchar_t /Zc:forScope /Zc:inline /Fo"..\..\derived\Win32-VC-Release\3rdParty\build\SDL2_ttf-2.0.15\\" /Fd"..\..\derived\Win32-VC-Release\3rdParty\build\SDL2_ttf-2.0.15\SDL_ttf.pdb" /Gd /TC /analyze- /FC /errorReport:queue "..\..\derived\3rdParty\src\SDL2_ttf-2.0.15\SDL_ttf.c"
     7>PreBuildEvent:
                 1 file(s) copied.
     4>Lib:
         All outputs are up-to-date.
         libogg.vcxproj -> C:\compiler\openMSX\build\3rdparty\..\..\derived\Win32-VC-Release\3rdParty\install\lib\libogg.lib
     8>ClCompile:
         All outputs are up-to-date.
       Lib:
         All outputs are up-to-date.
         SDL.vcxproj -> C:\compiler\openMSX\build\3rdparty\..\..\derived\Win32-VC-Release\3rdParty\install\lib\SDL.lib
       FinalizeBuildStatus:
         Deleting file "..\..\derived\Win32-VC-Release\3rdParty\build\SDL2-2.0.10\SDL.tlog\unsuccessfulbuild".
         Touching "..\..\derived\Win32-VC-Release\3rdParty\build\SDL2-2.0.10\SDL.tlog\SDL.lastbuildstate".
     8>Done Building Project "C:\compiler\openMSX\build\3rdparty\SDL.vcxproj" (default targets).
     4>FinalizeBuildStatus:
         Deleting file "..\..\derived\Win32-VC-Release\3rdParty\build\libogg-1.3.3\libogg.tlog\unsuccessfulbuild".
         Touching "..\..\derived\Win32-VC-Release\3rdParty\build\libogg-1.3.3\libogg.tlog\libogg.lastbuildstate".
     4>Done Building Project "C:\compiler\openMSX\build\3rdparty\libogg.vcxproj" (default targets).
     7>ClCompile:
         All outputs are up-to-date.
     1>Project "C:\compiler\openMSX\build\3rdparty\3rdparty.sln" (1) is building "C:\compiler\openMSX\build\3rdparty\SDLmain.vcxproj" (10) on node 1 (default targets).
    10>InitializeBuildStatus:
         Creating "..\..\derived\Win32-VC-Release\3rdParty\build\SDLmain\SDLmain.tlog\unsuccessfulbuild" because "AlwaysCreate" was specified.
       ClCompile:
         All outputs are up-to-date.
     7>ResourceCompile:
         All outputs are up-to-date.
    10>Lib:
         All outputs are up-to-date.
         SDLmain.vcxproj -> C:\compiler\openMSX\build\3rdparty\..\..\derived\Win32-VC-Release\3rdParty\install\lib\SDLmain.lib
       FinalizeBuildStatus:
         Deleting file "..\..\derived\Win32-VC-Release\3rdParty\build\SDLmain\SDLmain.tlog\unsuccessfulbuild".
         Touching "..\..\derived\Win32-VC-Release\3rdParty\build\SDLmain\SDLmain.tlog\SDLmain.lastbuildstate".
    10>Done Building Project "C:\compiler\openMSX\build\3rdparty\SDLmain.vcxproj" (default targets).
     1>Project "C:\compiler\openMSX\build\3rdparty\3rdparty.sln" (1) is building "C:\compiler\openMSX\build\3rdparty\tcl.vcxproj" (11) on node 3 (default targets).
    11>InitializeBuildStatus:
         Creating "..\..\derived\Win32-VC-Release\3rdParty\build\tcl8.6.9\tcl.tlog\unsuccessfulbuild" because "AlwaysCreate" was specified.
     1>Project "C:\compiler\openMSX\build\3rdparty\3rdparty.sln" (1) is building "C:\compiler\openMSX\build\3rdparty\zlib.vcxproj" (12) on node 1 (default targets).
    12>InitializeBuildStatus:
         Creating "..\..\derived\Win32-VC-Release\3rdParty\build\zlib-1.2.11\zlib.tlog\unsuccessfulbuild" because "AlwaysCreate" was specified.
     7>Lib:
         All outputs are up-to-date.
         libpng.vcxproj -> C:\compiler\openMSX\build\3rdparty\..\..\derived\Win32-VC-Release\3rdParty\install\lib\libpng.lib
       FinalizeBuildStatus:
         Deleting file "..\..\derived\Win32-VC-Release\3rdParty\build\libpng-1.6.36\libpng.tlog\unsuccessfulbuild".
         Touching "..\..\derived\Win32-VC-Release\3rdParty\build\libpng-1.6.36\libpng.tlog\libpng.lastbuildstate".
     7>Done Building Project "C:\compiler\openMSX\build\3rdparty\libpng.vcxproj" (default targets).
    12>ClCompile:
         All outputs are up-to-date.
       ResourceCompile:
         All outputs are up-to-date.
       Lib:
         All outputs are up-to-date.
         zlib.vcxproj -> C:\compiler\openMSX\build\3rdparty\..\..\derived\Win32-VC-Release\3rdParty\install\lib\zlib.lib
       FinalizeBuildStatus:
         Deleting file "..\..\derived\Win32-VC-Release\3rdParty\build\zlib-1.2.11\zlib.tlog\unsuccessfulbuild".
         Touching "..\..\derived\Win32-VC-Release\3rdParty\build\zlib-1.2.11\zlib.tlog\zlib.lastbuildstate".
    12>Done Building Project "C:\compiler\openMSX\build\3rdparty\zlib.vcxproj" (default targets).
    11>ClCompile:
         All outputs are up-to-date.
       Lib:
         All outputs are up-to-date.
         tcl.vcxproj -> C:\compiler\openMSX\build\3rdparty\..\..\derived\Win32-VC-Release\3rdParty\install\lib\tcl.lib
       FinalizeBuildStatus:
         Deleting file "..\..\derived\Win32-VC-Release\3rdParty\build\tcl8.6.9\tcl.tlog\unsuccessfulbuild".
         Touching "..\..\derived\Win32-VC-Release\3rdParty\build\tcl8.6.9\tcl.tlog\tcl.lastbuildstate".
    11>Done Building Project "C:\compiler\openMSX\build\3rdparty\tcl.vcxproj" (default targets).
     5>ClCompile:
         autofit.c
     9>ClCompile:
         SDL_ttf.c
     9>C:\compiler\openMSX\derived\3rdParty\src\SDL2_ttf-2.0.15\SDL_ttf.c(602,38): warning C4244: '+=': conversion from 'float' to 'int', possible loss of data [C:\compiler\openMSX\build\3rdparty\SDL_ttf.vcxproj]
     9>C:\compiler\openMSX\derived\3rdParty\src\SDL2_ttf-2.0.15\SDL_ttf.c(603,38): warning C4244: '+=': conversion from 'float' to 'int', possible loss of data [C:\compiler\openMSX\build\3rdparty\SDL_ttf.vcxproj]
     9>C:\compiler\openMSX\derived\3rdParty\src\SDL2_ttf-2.0.15\SDL_ttf.c(1949,55): warning C4018: '>': signed/unsigned mismatch [C:\compiler\openMSX\build\3rdparty\SDL_ttf.vcxproj]
     5>ClCompile:
         ftbbox.c
         ftbitmap.c
         ftgasp.c
     9>Lib:
         C:\Program Files (x86)\Microsoft Visual Studio\2019\Professional\VC\Tools\MSVC\14.24.28314\bin\HostX86\x86\Lib.exe /OUT:"..\..\derived\Win32-VC-Release\3rdParty\install\lib\SDL_ttf.lib" /NOLOGO /MACHINE:X86 /LTCG "..\..\derived\Win32-VC-Release\3rdParty\build\SDL2_ttf-2.0.15\SDL_ttf.obj"
     5>ClCompile:
         ftpfr.c
         ftstroke.c
         ftsynth.c
         fttype1.c
         ftwinfnt.c
     9>Lib:
         SDL_ttf.vcxproj -> C:\compiler\openMSX\build\3rdparty\..\..\derived\Win32-VC-Release\3rdParty\install\lib\SDL_ttf.lib
       FinalizeBuildStatus:
         Deleting file "..\..\derived\Win32-VC-Release\3rdParty\build\SDL2_ttf-2.0.15\SDL_ttf.tlog\unsuccessfulbuild".
         Touching "..\..\derived\Win32-VC-Release\3rdParty\build\SDL2_ttf-2.0.15\SDL_ttf.tlog\SDL_ttf.lastbuildstate".
     9>Done Building Project "C:\compiler\openMSX\build\3rdparty\SDL_ttf.vcxproj" (default targets).
     5>ClCompile:
         C:\Program Files (x86)\Microsoft Visual Studio\2019\Professional\VC\Tools\MSVC\14.24.28314\bin\HostX86\x86\CL.exe /c /I"..\..\derived\3rdParty\src\freetype-2.9.1\include" /nologo /W4 /WX- /diagnostics:column /O2 /Ob2 /Oi /Os /Oy /GT /GL /D NDEBUG /D WIN32 /D _LIB /D FT2_BUILD_LIBRARY /D _CRT_SECURE_NO_WARNINGS /D _VC80_UPGRADE=0x0710 /D _MBCS /GF /Gm- /EHsc /MT /GS /Gy /fp:precise /Za /Zc:wchar_t /Zc:forScope /Zc:inline /Fo"..\..\derived\Win32-VC-Release\3rdParty\build\freetype-2.9.1\\" /Fd"..\..\derived\Win32-VC-Release\3rdParty\build\freetype-2.9.1\freetype.pdb" /Gd /TC /wd4001 /analyze- /FC /errorReport:queue "..\..\derived\3rdParty\src\freetype-2.9.1\src\base\ftbase.c" "..\..\derived\3rdParty\src\freetype-2.9.1\src\base\ftglyph.c" "..\..\derived\3rdParty\src\freetype-2.9.1\src\base\ftinit.c" "..\..\derived\3rdParty\src\freetype-2.9.1\src\base\ftmm.c" "..\..\derived\3rdParty\src\freetype-2.9.1\src\base\ftsystem.c" "..\..\derived\3rdParty\src\freetype-2.9.1\src\bdf\bdf.c" "..\..\derived\3rdParty\src\freetype-2.9.1\src\cache\ftcache.c" "..\..\derived\3rdParty\src\freetype-2.9.1\src\cff\cff.c" "..\..\derived\3rdParty\src\freetype-2.9.1\src\cid\type1cid.c" "..\..\derived\3rdParty\src\freetype-2.9.1\src\gzip\ftgzip.c" "..\..\derived\3rdParty\src\freetype-2.9.1\src\lzw\ftlzw.c" "..\..\derived\3rdParty\src\freetype-2.9.1\src\pcf\pcf.c" "..\..\derived\3rdParty\src\freetype-2.9.1\src\pfr\pfr.c" "..\..\derived\3rdParty\src\freetype-2.9.1\src\psaux\psaux.c" "..\..\derived\3rdParty\src\freetype-2.9.1\src\pshinter\pshinter.c" "..\..\derived\3rdParty\src\freetype-2.9.1\src\psnames\psmodule.c" "..\..\derived\3rdParty\src\freetype-2.9.1\src\raster\raster.c" "..\..\derived\3rdParty\src\freetype-2.9.1\src\sfnt\sfnt.c" "..\..\derived\3rdParty\src\freetype-2.9.1\src\smooth\smooth.c" "..\..\derived\3rdParty\src\freetype-2.9.1\src\truetype\truetype.c" "..\..\derived\3rdParty\src\freetype-2.9.1\src\type1\type1.c" "..\..\derived\3rdParty\src\freetype-2.9.1\src\type42\type42.c" "..\..\derived\3rdParty\src\freetype-2.9.1\src\winfonts\winfnt.c"
         ftbase.c
         ftglyph.c
         ftinit.c
         ftmm.c
         ftsystem.c
         bdf.c
         ftcache.c
         cff.c
         type1cid.c
         ftgzip.c
         ftlzw.c
         pcf.c
         pfr.c
         psaux.c
         pshinter.c
         psmodule.c
         raster.c
         sfnt.c
         smooth.c
         truetype.c
         Compiling...
         type1.c
         type42.c
         winfnt.c
         C:\Program Files (x86)\Microsoft Visual Studio\2019\Professional\VC\Tools\MSVC\14.24.28314\bin\HostX86\x86\CL.exe /c /I"..\..\derived\3rdParty\src\freetype-2.9.1\include" /nologo /W4 /WX- /diagnostics:column /O2 /Ob2 /Oi /Os /Oy /GT /GL /D NDEBUG /D WIN32 /D _LIB /D FT2_BUILD_LIBRARY /D _CRT_SECURE_NO_WARNINGS /D _VC80_UPGRADE=0x0710 /D _MBCS /GF /Gm- /EHsc /MT /GS /Gy /fp:precise /Zc:wchar_t /Zc:forScope /Zc:inline /Fo"..\..\derived\Win32-VC-Release\3rdParty\build\freetype-2.9.1\\" /Fd"..\..\derived\Win32-VC-Release\3rdParty\build\freetype-2.9.1\freetype.pdb" /Gd /TC /wd4001 /analyze- /FC /errorReport:queue "..\..\derived\3rdParty\src\freetype-2.9.1\builds\windows\ftdebug.c"
         ftdebug.c
       Lib:
         C:\Program Files (x86)\Microsoft Visual Studio\2019\Professional\VC\Tools\MSVC\14.24.28314\bin\HostX86\x86\Lib.exe /OUT:"..\..\derived\Win32-VC-Release\3rdParty\install\lib\freetype.lib" /NOLOGO /MACHINE:X86 /LTCG "..\..\derived\Win32-VC-Release\3rdParty\build\freetype-2.9.1\autofit.obj"
         "..\..\derived\Win32-VC-Release\3rdParty\build\freetype-2.9.1\bdf.obj"
         "..\..\derived\Win32-VC-Release\3rdParty\build\freetype-2.9.1\cff.obj"
         "..\..\derived\Win32-VC-Release\3rdParty\build\freetype-2.9.1\ftbase.obj"
         "..\..\derived\Win32-VC-Release\3rdParty\build\freetype-2.9.1\ftbitmap.obj"
         "..\..\derived\Win32-VC-Release\3rdParty\build\freetype-2.9.1\ftcache.obj"
         "..\..\derived\Win32-VC-Release\3rdParty\build\freetype-2.9.1\ftdebug.obj"
         "..\..\derived\Win32-VC-Release\3rdParty\build\freetype-2.9.1\ftgasp.obj"
         "..\..\derived\Win32-VC-Release\3rdParty\build\freetype-2.9.1\ftglyph.obj"
         "..\..\derived\Win32-VC-Release\3rdParty\build\freetype-2.9.1\ftgzip.obj"
         "..\..\derived\Win32-VC-Release\3rdParty\build\freetype-2.9.1\ftinit.obj"
         "..\..\derived\Win32-VC-Release\3rdParty\build\freetype-2.9.1\ftlzw.obj"
         "..\..\derived\Win32-VC-Release\3rdParty\build\freetype-2.9.1\ftstroke.obj"
         "..\..\derived\Win32-VC-Release\3rdParty\build\freetype-2.9.1\ftsystem.obj"
         "..\..\derived\Win32-VC-Release\3rdParty\build\freetype-2.9.1\smooth.obj"
         "..\..\derived\Win32-VC-Release\3rdParty\build\freetype-2.9.1\ftbbox.obj"
         "..\..\derived\Win32-VC-Release\3rdParty\build\freetype-2.9.1\ftmm.obj"
         "..\..\derived\Win32-VC-Release\3rdParty\build\freetype-2.9.1\ftpfr.obj"
         "..\..\derived\Win32-VC-Release\3rdParty\build\freetype-2.9.1\ftsynth.obj"
         "..\..\derived\Win32-VC-Release\3rdParty\build\freetype-2.9.1\fttype1.obj"
         "..\..\derived\Win32-VC-Release\3rdParty\build\freetype-2.9.1\ftwinfnt.obj"
         "..\..\derived\Win32-VC-Release\3rdParty\build\freetype-2.9.1\pcf.obj"
         "..\..\derived\Win32-VC-Release\3rdParty\build\freetype-2.9.1\pfr.obj"
         "..\..\derived\Win32-VC-Release\3rdParty\build\freetype-2.9.1\psaux.obj"
         "..\..\derived\Win32-VC-Release\3rdParty\build\freetype-2.9.1\pshinter.obj"
         "..\..\derived\Win32-VC-Release\3rdParty\build\freetype-2.9.1\psmodule.obj"
         "..\..\derived\Win32-VC-Release\3rdParty\build\freetype-2.9.1\raster.obj"
         "..\..\derived\Win32-VC-Release\3rdParty\build\freetype-2.9.1\sfnt.obj"
         "..\..\derived\Win32-VC-Release\3rdParty\build\freetype-2.9.1\truetype.obj"
         "..\..\derived\Win32-VC-Release\3rdParty\build\freetype-2.9.1\type1.obj"
         "..\..\derived\Win32-VC-Release\3rdParty\build\freetype-2.9.1\type1cid.obj"
         "..\..\derived\Win32-VC-Release\3rdParty\build\freetype-2.9.1\type42.obj"
         "..\..\derived\Win32-VC-Release\3rdParty\build\freetype-2.9.1\winfnt.obj"
         freetype.vcxproj -> C:\compiler\openMSX\build\3rdparty\..\..\derived\Win32-VC-Release\3rdParty\install\lib\freetype.lib
       FinalizeBuildStatus:
         Deleting file "..\..\derived\Win32-VC-Release\3rdParty\build\freetype-2.9.1\freetype.tlog\unsuccessfulbuild".
         Touching "..\..\derived\Win32-VC-Release\3rdParty\build\freetype-2.9.1\freetype.tlog\freetype.lastbuildstate".
     5>Done Building Project "C:\compiler\openMSX\build\3rdparty\freetype.vcxproj" (default targets).
     1>Done Building Project "C:\compiler\openMSX\build\3rdparty\3rdparty.sln" (default targets).

Build succeeded.

       "C:\compiler\openMSX\build\3rdparty\3rdparty.sln" (default target) (1) ->
       "C:\compiler\openMSX\build\3rdparty\SDL_ttf.vcxproj" (default target) (9) ->
       (ClCompile target) -> 
         C:\compiler\openMSX\derived\3rdParty\src\SDL2_ttf-2.0.15\SDL_ttf.c(602,38): warning C4244: '+=': conversion from 'float' to 'int', possible loss of data [C:\compiler\openMSX\build\3rdparty\SDL_ttf.vcxproj]
         C:\compiler\openMSX\derived\3rdParty\src\SDL2_ttf-2.0.15\SDL_ttf.c(603,38): warning C4244: '+=': conversion from 'float' to 'int', possible loss of data [C:\compiler\openMSX\build\3rdparty\SDL_ttf.vcxproj]
         C:\compiler\openMSX\derived\3rdParty\src\SDL2_ttf-2.0.15\SDL_ttf.c(1949,55): warning C4018: '>': signed/unsigned mismatch [C:\compiler\openMSX\build\3rdparty\SDL_ttf.vcxproj]

    3 Warning(s)
    0 Error(s)

Time Elapsed 00:00:05.88
Back To Top

32 bit compile

Microsoft (R) Build Engine version 16.4.0+e901037fe for .NET Framework
Copyright (C) Microsoft Corporation. All rights reserved.

Build started 3/29/2020 10:51:41 AM.
     1>Project "C:\compiler\openMSX\build\msvc\openmsx.sln" on node 1 (default targets).
     1>ValidateSolutionConfiguration:
         Building solution configuration "Release|Win32".
     1>Project "C:\compiler\openMSX\build\msvc\openmsx.sln" (1) is building "C:\compiler\openMSX\build\msvc\openmsx.vcxproj" (2) on node 1 (default targets).
     2>InitializeBuildStatus:
         Creating "..\..\derived\Win32-VC-Release\build\openmsx.tlog\unsuccessfulbuild" because "AlwaysCreate" was specified.
       CustomBuild:
         Generating config headers...
         Up to date: C:\compiler\openMSX\derived\Win32-VC-Release\config\build-info.hh
         Up to date: C:\compiler\openMSX\derived\Win32-VC-Release\config\components.hh
         Up to date: C:\compiler\openMSX\derived\Win32-VC-Release\config\systemfuncs.hh
         Updating C:\compiler\openMSX\derived\Win32-VC-Release\config\resource-info.h...
         Updating C:\compiler\openMSX\derived\Win32-VC-Release\config\version.ii...
     2>C:\Program Files (x86)\Microsoft Visual Studio\2019\Professional\MSBuild\Microsoft\VC\v160\Microsoft.CppCommon.targets(231,5): warning MSB8065: Custom build for item "..\..\src\openmsx.hh" succeeded, but specified output "c:\compiler\openmsx\build\msvc\build-info.hh" has not been created. This may cause incremental build to work incorrectly. [C:\compiler\openMSX\build\msvc\openmsx.vcxproj]
     2>C:\Program Files (x86)\Microsoft Visual Studio\2019\Professional\MSBuild\Microsoft\VC\v160\Microsoft.CppCommon.targets(231,5): warning MSB8065: Custom build for item "..\..\src\openmsx.hh" succeeded, but specified output "c:\compiler\openmsx\build\msvc\components.hh" has not been created. This may cause incremental build to work incorrectly. [C:\compiler\openMSX\build\msvc\openmsx.vcxproj]
     2>C:\Program Files (x86)\Microsoft Visual Studio\2019\Professional\MSBuild\Microsoft\VC\v160\Microsoft.CppCommon.targets(231,5): warning MSB8065: Custom build for item "..\..\src\openmsx.hh" succeeded, but specified output "c:\compiler\openmsx\build\msvc\probed_defs.hh" has not been created. This may cause incremental build to work incorrectly. [C:\compiler\openMSX\build\msvc\openmsx.vcxproj]
     2>C:\Program Files (x86)\Microsoft Visual Studio\2019\Professional\MSBuild\Microsoft\VC\v160\Microsoft.CppCommon.targets(231,5): warning MSB8065: Custom build for item "..\..\src\openmsx.hh" succeeded, but specified output "c:\compiler\openmsx\build\msvc\resource-info.h" has not been created. This may cause incremental build to work incorrectly. [C:\compiler\openMSX\build\msvc\openmsx.vcxproj]
     2>C:\Program Files (x86)\Microsoft Visual Studio\2019\Professional\MSBuild\Microsoft\VC\v160\Microsoft.CppCommon.targets(231,5): warning MSB8065: Custom build for item "..\..\src\openmsx.hh" succeeded, but specified output "c:\compiler\openmsx\build\msvc\version.ii" has not been created. This may cause incremental build to work incorrectly. [C:\compiler\openMSX\build\msvc\openmsx.vcxproj]
       ClCompile:
         C:\Program Files (x86)\Microsoft Visual Studio\2019\Professional\VC\Tools\MSVC\14.24.28314\bin\HostX64\x86\CL.exe /c /I"..\..\derived\Win32-VC-Release\config" /I\Include /I"..\..\derived\3rdParty\src\freetype-2.9.1" /I"..\..\derived\3rdParty\src\glew-2.1.0\include" /I"..\..\derived\3rdParty\src\libpng-1.6.36" /I"..\..\derived\3rdParty\src\SDL2-2.0.10\include" /I"..\..\derived\3rdParty\src\SDL2_ttf-2.0.15" /I"..\..\derived\3rdParty\src\libtheora-1.1.1\include" /I"..\..\derived\3rdParty\src\libvorbis-1.3.6\include" /I"..\..\derived\3rdParty\src\libogg-1.3.3\include" /I..\..\derived\3rdParty\src\tcl8.6.9\generic /I"..\..\derived\3rdParty\src\zlib-1.2.11" /I..\..\src /I..\..\src\cassette /I..\..\src\commands /I..\..\src\config /I..\..\src\console /I..\..\src\cpu /I..\..\src\debugger /I..\..\src\events /I..\..\src\fdc /I..\..\src\file /I..\..\src\ide /I..\..\src\input /I..\..\src\laserdisc /I..\..\src\memory /I..\..\src\resource /I..\..\src\security /I..\..\src\serial /I..\..\src\settings /I..\..\src\sound /I..\..\src\thread /I..\..\src\utils /I..\..\src\video /I..\..\src\video\scalers /I..\..\src\video\ld /I..\..\src\video\v9990 /Zi /nologo /W4 /WX- /diagnostics:column /Ox /Ob2 /Oi /Os /Oy /GT /GL /D __SSE__ /D __SSE2__ /D WIN32 /D WIN32_LEAN_AND_MEAN /D UNICODE /D _UNICODE /D SECURITY_WIN32 /D NDEBUG /D _CONSOLE /D _USE_MATH_DEFINES /D _CRT_SECURE_NO_WARNINGS /D _CRT_NONSTDC_NO_DEPRECATE /D NOMINMAX /D GLEW_STATIC /D STATIC_BUILD /D _UNICODE /D UNICODE /GF /Gm- /EHsc /MT /GS /Gy /fp:precise /Zc:wchar_t /Zc:forScope /Zc:inline /std:c++17 /Fo"..\..\derived\Win32-VC-Release\build\\" /Fd"..\..\derived\Win32-VC-Release\build\vc142.pdb" /Gd /TP /wd4324 /wd4063 /wd4121 /wd4125 /wd4127 /wd4189 /wd4201 /wd4244 /wd4310 /wd4355 /wd4505 /wd4512 /wd4611 /wd4702 /analyze- /FC /errorReport:queue /constexpr:steps20000000 /MP ..\..\src\cassette\CassettePlayer.cc ..\..\src\cassette\CassettePort.cc ..\..\src\events\InputEventGenerator.cc ..\..\src\fdc\RealDrive.cc ..\..\src\ide\HD.cc ..\..\src\ide\BeerIDE.cc ..\..\src\input\Joystick.cc ..\..\src\memory\Carnivore2.cc ..\..\src\memory\CheckedRam.cc ..\..\src\memory\ColecoSuperGameModule.cc ..\..\src\memory\ESE_SCC.cc ..\..\src\memory\MSXHBI55.cc ..\..\src\memory\MusicalMemoryMapper.cc ..\..\src\memory\RomFactory.cc ..\..\src\memory\RomKonamiKeyboardMaster.cc ..\..\src\memory\RomKonamiSCC.cc ..\..\src\memory\RomMajutsushi.cc ..\..\src\memory\RomManbow2.cc ..\..\src\memory\RomNettouYakyuu.cc ..\..\src\memory\RomPlayBall.cc ..\..\src\memory\RomSynthesizer.cc ..\..\src\memory\ReproCartridgeV1.cc ..\..\src\memory\ReproCartridgeV2.cc ..\..\src\memory\KonamiUltimateCollection.cc ..\..\src\memory\MegaFlashRomSCCPlus.cc ..\..\src\memory\MegaFlashRomSCCPlusSD.cc ..\..\src\sound\AY8910.cc ..\..\src\sound\DACSound16S.cc ..\..\src\sound\DACSound8U.cc ..\..\src\sound\KeyClick.cc ..\..\src\sound\MSXAudio.cc ..\..\src\sound\MSXFmPac.cc ..\..\src\sound\MSXMixer.cc ..\..\src\sound\MSXMoonSound.cc ..\..\src\sound\MSXMusic.cc ..\..\src\sound\MSXOPL3Cartridge.cc ..\..\src\sound\MSXPSG.cc ..\..\src\sound\MSXSCCPlusCart.cc ..\..\src\sound\MSXTurboRPCM.cc ..\..\src\sound\MSXYamahaSFG.cc ..\..\src\sound\ResampledSoundDevice.cc ..\..\src\sound\ResampleBlip.cc ..\..\src\sound\ResampleHQ.cc ..\..\src\sound\ResampleLQ.cc ..\..\src\sound\ResampleTrivial.cc ..\..\src\sound\SamplePlayer.cc ..\..\src\sound\SCC.cc ..\..\src\sound\SDLSoundDriver.cc ..\..\src\sound\SN76489.cc ..\..\src\sound\SNPSG.cc ..\..\src\sound\SoundDevice.cc ..\..\src\sound\VLM5030.cc ..\..\src\sound\Y8950.cc ..\..\src\sound\Y8950Adpcm.cc ..\..\src\sound\Y8950Periphery.cc ..\..\src\sound\YM2151.cc ..\..\src\sound\YM2413.cc ..\..\src\sound\YM2413Burczynski.cc ..\..\src\sound\YM2413Okazaki.cc ..\..\src\sound\YM2413NukeYKT.cc ..\..\src\sound\YM2413OriginalNukeYKT.cc ..\..\src\sound\opll.cc.cc ..\..\src\sound\YMF262.cc ..\..\src\sound\YMF278.cc ..\..\src\video\SDLVideoSystem.cc ..\..\src\video\VideoLayer.cc ..\..\src\video\ld\LDPixelRenderer.cc ..\..\src\laserdisc\LaserdiscPlayer.cc ..\..\src\laserdisc\PioneerLDControl.cc ..\..\src\DeviceFactory.cc ..\..\src\GlobalSettings.cc ..\..\src\MSXMotherBoard.cc ..\..\src\MSXPPI.cc ..\..\src\PrinterPortSimpl.cc ..\..\src\Reactor.cc ..\..\src\RealTime.cc ..\..\src\Version.cc ..\..\src\sound\SVIPSG.cc ..\..\src\SVIPPI.cc
         CassettePlayer.cc
         CassettePort.cc
         InputEventGenerator.cc
         RealDrive.cc
         HD.cc
         BeerIDE.cc
         Joystick.cc
         Carnivore2.cc
         CheckedRam.cc
         ColecoSuperGameModule.cc
         ESE_SCC.cc
         MSXHBI55.cc
         MusicalMemoryMapper.cc
         RomFactory.cc
         RomKonamiKeyboardMaster.cc
         RomKonamiSCC.cc
         RomMajutsushi.cc
         RomManbow2.cc
         RomNettouYakyuu.cc
         RomPlayBall.cc
         RomSynthesizer.cc
         ReproCartridgeV1.cc
         ReproCartridgeV2.cc
         KonamiUltimateCollection.cc
         MegaFlashRomSCCPlus.cc
         MegaFlashRomSCCPlusSD.cc
         AY8910.cc
         DACSound16S.cc
         DACSound8U.cc
         KeyClick.cc
         MSXAudio.cc
         MSXFmPac.cc
         MSXMixer.cc
         MSXMoonSound.cc
         MSXMusic.cc
         MSXOPL3Cartridge.cc
         MSXPSG.cc
         MSXSCCPlusCart.cc
         MSXTurboRPCM.cc
         MSXYamahaSFG.cc
         ResampledSoundDevice.cc
         ResampleBlip.cc
         ResampleHQ.cc
         ResampleLQ.cc
         ResampleTrivial.cc
         SamplePlayer.cc
         SCC.cc
         SDLSoundDriver.cc
         SN76489.cc
         SNPSG.cc
         SoundDevice.cc
         VLM5030.cc
         Y8950.cc
         Y8950Adpcm.cc
         Y8950Periphery.cc
         YM2151.cc
         YM2413.cc
         YM2413Burczynski.cc
         YM2413Okazaki.cc
         YM2413NukeYKT.cc
         YM2413OriginalNukeYKT.cc
     2>C:\compiler\openMSX\src\sound\YM2413NukeYKT.cc(327,1): warning C4805: '|=': unsafe mix of type 'bool' and type 'int' in operation [C:\compiler\openMSX\build\msvc\openmsx.vcxproj]
       C:\compiler\openMSX\src\sound\YM2413NukeYKT.cc(786): message : see reference to function template instantiation 'void openmsx::YM2413NukeYKT::YM2413::envelopeGenerate2<0>(const openmsx::YM2413NukeYKT::YM2413::Patch &,bool)' being compiled [C:\compiler\openMSX\build\msvc\openmsx.vcxproj]
       C:\compiler\openMSX\src\sound\YM2413NukeYKT.cc(838): message : see reference to function template instantiation 'void openmsx::YM2413NukeYKT::YM2413::step<0,true>(openmsx::YM2413NukeYKT::YM2413::Locals &)' being compiled [C:\compiler\openMSX\build\msvc\openmsx.vcxproj]
       C:\compiler\openMSX\src\sound\YM2413NukeYKT.cc(820): message : see reference to function template instantiation 'void openmsx::YM2413NukeYKT::YM2413::step18(float *[])' being compiled [C:\compiler\openMSX\build\msvc\openmsx.vcxproj]
       C:\compiler\openMSX\src\sound\YM2413NukeYKT.hh(138): message : see reference to class template instantiation 'std::array' being compiled (compiling source file ..\..\src\sound\YM2413NukeYKT.cc) [C:\compiler\openMSX\build\msvc\openmsx.vcxproj]
     2>C:\compiler\openMSX\src\sound\YM2413NukeYKT.cc(327,1): warning C4805: '|': unsafe mix of type 'bool' and type 'int' in operation [C:\compiler\openMSX\build\msvc\openmsx.vcxproj]
     2>C:\compiler\openMSX\src\sound\YM2413NukeYKT.cc(330,1): warning C4805: '|=': unsafe mix of type 'bool' and type 'int' in operation [C:\compiler\openMSX\build\msvc\openmsx.vcxproj]
     2>C:\compiler\openMSX\src\sound\YM2413NukeYKT.cc(330,1): warning C4805: '|': unsafe mix of type 'bool' and type 'int' in operation [C:\compiler\openMSX\build\msvc\openmsx.vcxproj]
     2>C:\compiler\openMSX\src\sound\YM2413NukeYKT.cc(333,1): warning C4805: '|=': unsafe mix of type 'bool' and type 'int' in operation [C:\compiler\openMSX\build\msvc\openmsx.vcxproj]
     2>C:\compiler\openMSX\src\sound\YM2413NukeYKT.cc(333,1): warning C4805: '|': unsafe mix of type 'bool' and type 'int' in operation [C:\compiler\openMSX\build\msvc\openmsx.vcxproj]
     2>C:\compiler\openMSX\src\sound\YM2413NukeYKT.cc(336,1): warning C4805: '|=': unsafe mix of type 'bool' and type 'int' in operation [C:\compiler\openMSX\build\msvc\openmsx.vcxproj]
     2>C:\compiler\openMSX\src\sound\YM2413NukeYKT.cc(336,1): warning C4805: '|': unsafe mix of type 'bool' and type 'int' in operation [C:\compiler\openMSX\build\msvc\openmsx.vcxproj]
     2>C:\compiler\openMSX\src\sound\YM2413NukeYKT.cc(454,1): warning C4805: '|=': unsafe mix of type 'bool' and type 'int' in operation [C:\compiler\openMSX\build\msvc\openmsx.vcxproj]
       C:\compiler\openMSX\src\sound\YM2413NukeYKT.cc(790): message : see reference to function template instantiation 'void openmsx::YM2413NukeYKT::YM2413::doRhythm<0,true>(void)' being compiled [C:\compiler\openMSX\build\msvc\openmsx.vcxproj]
     2>C:\compiler\openMSX\src\sound\YM2413NukeYKT.cc(454,1): warning C4805: '|': unsafe mix of type 'bool' and type 'int' in operation [C:\compiler\openMSX\build\msvc\openmsx.vcxproj]
         opll.cc.cc
     2>c1xx : fatal error C1083: Cannot open source file: '..\..\src\sound\opll.cc.cc': No such file or directory [C:\compiler\openMSX\build\msvc\openmsx.vcxproj]
         YMF262.cc
         YMF278.cc
         SDLVideoSystem.cc
         VideoLayer.cc
         LDPixelRenderer.cc
         LaserdiscPlayer.cc
         PioneerLDControl.cc
         DeviceFactory.cc
         GlobalSettings.cc
         MSXMotherBoard.cc
         MSXPPI.cc
         PrinterPortSimpl.cc
         Reactor.cc
         RealTime.cc
         Version.cc
         SVIPSG.cc
         SVIPPI.cc
     2>Done Building Project "C:\compiler\openMSX\build\msvc\openmsx.vcxproj" (default targets) -- FAILED.
     1>Done Building Project "C:\compiler\openMSX\build\msvc\openmsx.sln" (default targets) -- FAILED.

Build FAILED.

       "C:\compiler\openMSX\build\msvc\openmsx.sln" (default target) (1) ->
       "C:\compiler\openMSX\build\msvc\openmsx.vcxproj" (default target) (2) ->
       (CustomBuild target) -> 
         C:\Program Files (x86)\Microsoft Visual Studio\2019\Professional\MSBuild\Microsoft\VC\v160\Microsoft.CppCommon.targets(231,5): warning MSB8065: Custom build for item "..\..\src\openmsx.hh" succeeded, but specified output "c:\compiler\openmsx\build\msvc\build-info.hh" has not been created. This may cause incremental build to work incorrectly. [C:\compiler\openMSX\build\msvc\openmsx.vcxproj]
         C:\Program Files (x86)\Microsoft Visual Studio\2019\Professional\MSBuild\Microsoft\VC\v160\Microsoft.CppCommon.targets(231,5): warning MSB8065: Custom build for item "..\..\src\openmsx.hh" succeeded, but specified output "c:\compiler\openmsx\build\msvc\components.hh" has not been created. This may cause incremental build to work incorrectly. [C:\compiler\openMSX\build\msvc\openmsx.vcxproj]
         C:\Program Files (x86)\Microsoft Visual Studio\2019\Professional\MSBuild\Microsoft\VC\v160\Microsoft.CppCommon.targets(231,5): warning MSB8065: Custom build for item "..\..\src\openmsx.hh" succeeded, but specified output "c:\compiler\openmsx\build\msvc\probed_defs.hh" has not been created. This may cause incremental build to work incorrectly. [C:\compiler\openMSX\build\msvc\openmsx.vcxproj]
         C:\Program Files (x86)\Microsoft Visual Studio\2019\Professional\MSBuild\Microsoft\VC\v160\Microsoft.CppCommon.targets(231,5): warning MSB8065: Custom build for item "..\..\src\openmsx.hh" succeeded, but specified output "c:\compiler\openmsx\build\msvc\resource-info.h" has not been created. This may cause incremental build to work incorrectly. [C:\compiler\openMSX\build\msvc\openmsx.vcxproj]
         C:\Program Files (x86)\Microsoft Visual Studio\2019\Professional\MSBuild\Microsoft\VC\v160\Microsoft.CppCommon.targets(231,5): warning MSB8065: Custom build for item "..\..\src\openmsx.hh" succeeded, but specified output "c:\compiler\openmsx\build\msvc\version.ii" has not been created. This may cause incremental build to work incorrectly. [C:\compiler\openMSX\build\msvc\openmsx.vcxproj]


       "C:\compiler\openMSX\build\msvc\openmsx.sln" (default target) (1) ->
       "C:\compiler\openMSX\build\msvc\openmsx.vcxproj" (default target) (2) ->
       (ClCompile target) -> 
         C:\compiler\openMSX\src\sound\YM2413NukeYKT.cc(327,1): warning C4805: '|=': unsafe mix of type 'bool' and type 'int' in operation [C:\compiler\openMSX\build\msvc\openmsx.vcxproj]
         C:\compiler\openMSX\src\sound\YM2413NukeYKT.cc(327,1): warning C4805: '|': unsafe mix of type 'bool' and type 'int' in operation [C:\compiler\openMSX\build\msvc\openmsx.vcxproj]
         C:\compiler\openMSX\src\sound\YM2413NukeYKT.cc(330,1): warning C4805: '|=': unsafe mix of type 'bool' and type 'int' in operation [C:\compiler\openMSX\build\msvc\openmsx.vcxproj]
         C:\compiler\openMSX\src\sound\YM2413NukeYKT.cc(330,1): warning C4805: '|': unsafe mix of type 'bool' and type 'int' in operation [C:\compiler\openMSX\build\msvc\openmsx.vcxproj]
         C:\compiler\openMSX\src\sound\YM2413NukeYKT.cc(333,1): warning C4805: '|=': unsafe mix of type 'bool' and type 'int' in operation [C:\compiler\openMSX\build\msvc\openmsx.vcxproj]
         C:\compiler\openMSX\src\sound\YM2413NukeYKT.cc(333,1): warning C4805: '|': unsafe mix of type 'bool' and type 'int' in operation [C:\compiler\openMSX\build\msvc\openmsx.vcxproj]
         C:\compiler\openMSX\src\sound\YM2413NukeYKT.cc(336,1): warning C4805: '|=': unsafe mix of type 'bool' and type 'int' in operation [C:\compiler\openMSX\build\msvc\openmsx.vcxproj]
         C:\compiler\openMSX\src\sound\YM2413NukeYKT.cc(336,1): warning C4805: '|': unsafe mix of type 'bool' and type 'int' in operation [C:\compiler\openMSX\build\msvc\openmsx.vcxproj]
         C:\compiler\openMSX\src\sound\YM2413NukeYKT.cc(454,1): warning C4805: '|=': unsafe mix of type 'bool' and type 'int' in operation [C:\compiler\openMSX\build\msvc\openmsx.vcxproj]
         C:\compiler\openMSX\src\sound\YM2413NukeYKT.cc(454,1): warning C4805: '|': unsafe mix of type 'bool' and type 'int' in operation [C:\compiler\openMSX\build\msvc\openmsx.vcxproj]


       "C:\compiler\openMSX\build\msvc\openmsx.sln" (default target) (1) ->
       "C:\compiler\openMSX\build\msvc\openmsx.vcxproj" (default target) (2) ->
       (ClCompile target) -> 
         c1xx : fatal error C1083: Cannot open source file: '..\..\src\sound\opll.cc.cc': No such file or directory [C:\compiler\openMSX\build\msvc\openmsx.vcxproj]

    15 Warning(s)
    1 Error(s)

Time Elapsed 00:01:22.49
Back To Top

64bit MSI Package

OPENMSX_PLATFORM is x64
OPENMSX_CONFIGURATION is release
CATAPULT_BASEPATH is ..\\openmsx-wxcatapult
Generating install files...
  Executable...
Generating install files...
  Executable...
Back To Top

32bit MSI Package

OPENMSX_PLATFORM is win32
OPENMSX_CONFIGURATION is release
CATAPULT_BASEPATH is ..\\openmsx-wxcatapult
Generating install files...
  Executable...
Generating install files...
  Executable...
Back To Top
S